{"text_format":"1","workbook":"xlsx","n_sheets":17,"sheets":["Inmeetaanvraag","Toelichting","Inmeetformulier","Tijd","Offerte goederen","Offerte montage","Vertrekaanduidingen","Prijslijst","Offerte totaal","Bestelformulier","Factuurregels","Factuurspec. aanbet.","Factuurspec. deel- of restbet.","Dossier","Formulierdata","Klantdata","Leveranciersdata"],"not_rendered":{"charts":0,"images":11,"macros":1,"external_links":0,"defined_names":23,"comments":6,"pivot_tables":0},"unopened":[],"bounds":{"document_bytes":16777216,"sheet_cells":100000,"rows_first":2000,"rows_last":500,"rows_between":2000,"halvings":0,"cell_chars":16384,"cell_head_chars":4096},"cells_cut":0,"cells_raw":0,"read":"whole","date_system":"1900"}

{"sheet":"Inmeetaanvraag","index":0,"n_rows":18,"n_cols":11,"rows_kept":18,"cut":false,"hidden":false,"merged":[[9,2,9,6],[4,4,4,6],[5,2,5,6],[6,2,6,6],[7,3,7,6],[8,2,8,6],[16,2,16,6],[11,3,11,6],[12,3,12,6],[14,2,14,6],[14,7,15,9],[15,2,15,6]]}
[]
[null,null,"Verzoek om inmeting"]
[null,null,null,null,null,null,null,null,null,null,true]
[null,true,"Aanhef","Voorl.","Achternaam"]
[null,"Naam klant/contactpers.:"]
[null,"Organisatie:"]
[null,"Montage-adres:"]
[null,"Postcode/Wplts.:"]
[null,"Land:"]
[null,"E-mailadres:"]
[null,null,"Landcode","Tel.nr."]
[null,"Telefoon 1:"]
[null,"Telefoon 2:"]
[]
[null,"Uw projectomschrijving:",null,null,null,null,null,"Klaar met uw verzoek? Sla het op, klik op deze link en stuur dit\nvervolgens als bijlage bij een e-mailbericht naar info@mforcurtains.com"]
[]
[]
[null,"Vertrek","Artikelsoort","Plooi","Railtype","Railkleur","Bevest.","Artikelomschrijving","Merk (indien relevant/bekend)","Opmerkingen"]

{"sheet":"Toelichting","index":1,"n_rows":97,"n_cols":5,"rows_kept":97,"cut":false,"hidden":false,"merged":[]}
[]
[null,"Plooien",null,"Terug"]
[]
[null,null,null,null,"Enkel"]
[]
[]
[]
[]
[]
[]
[]
[]
[]
[null,null,null,null,"Dubbel"]
[]
[]
[]
[]
[]
[]
[]
[]
[]
[null,null,null,null,"Triple"]
[]
[]
[]
[]
[]
[]
[]
[]
[]
[null,null,null,null,"Dubbel retour"]
[]
[]
[]
[]
[]
[]
[]
[]
[]
[null,null,null,null,"Wave"]
[]
[]
[]
[]
[]
[]
[]
[]
[]
[]
[null,"Railtype",null,"Terug"]
[]
[null,null,null,null,"KS"]
[]
[]
[]
[]
[]
[]
[]
[]
[]
[null,null,null,null,"DS"]
[]
[]
[]
[]
[]
[]
[]
[]
[]
[null,null,null,null,"Interstil Square"]
[]
[]
[]
[]
[]
[]
[]
[]
[]
[null,null,null,null,"Interstil Round"]
[]
[]
[]
[]
[]
[]
[]
[]
[]
[null,null,null,null,"Interstil Flat"]

{"sheet":"Inmeetformulier","index":2,"n_rows":125,"n_cols":19,"rows_kept":125,"cut":false,"hidden":true,"merged":[[21,1,21,2],[14,2,14,3],[15,2,15,3],[21,6,21,7],[11,3,11,4],[12,3,12,4]]}
[]
[null,null,"Inmeetformulier"]
[]
[null,null,"Aanhef","Voorl.","Achternaam"]
[null,"Naam klant/contactpers.:",{"$f":"Inmeetaanvraag!C5","v":0},{"$f":"Inmeetaanvraag!D5","v":0},{"$f":"Inmeetaanvraag!E5","v":0}]
[null,"Organisatie:",{"$f":"Inmeetaanvraag!C6","v":0}]
[null,"Montage-adres:",{"$f":"Inmeetaanvraag!C7","v":0}]
[null,"Postcode/Wplts.:",{"$f":"Inmeetaanvraag!C8","v":0},{"$f":"Inmeetaanvraag!D8","v":0}]
[null,"Land:",{"$f":"Inmeetaanvraag!C9","v":0}]
[null,"E-mailadres:",{"$f":"Inmeetaanvraag!C10","v":0}]
[null,null,"Landcode","Tel.nr."]
[null,"Telefoon 1:",{"$f":"Inmeetaanvraag!C12","v":0},{"$f":"Inmeetaanvraag!D12","v":0}]
[null,"Telefoon 2:",{"$f":"Inmeetaanvraag!C13","v":0},{"$f":"Inmeetaanvraag!D13","v":0}]
[]
[null,"Inmeetdatum 1:",null,null,"van",null,"u         tot",null,"u"]
[null,"Inmeetdatum 2:",null,null,"van",null,"u         tot",null,"u"]
[]
[null,"Projectomschrijving klant:",{"$f":"Inmeetaanvraag!C15","v":0},null,null,null,null,null,null,null,"Korte projectomschrijving: ",{"$f":"IF(C18=0,\"\",LEFT(C18,20))","v":""},null,null,null,null,{"$f":"CONCATENATE(\" \",LEN(L18),\" tekens (max. 20 tekens)\")","v":" 0 tekens (max. 20 tekens)"}]
[null,null,{"$f":"Inmeetaanvraag!C16","v":0},null,null,null,null,null,null,null,"Bestandlocatie (evt.): "]
[null,null,{"$f":"Inmeetaanvraag!C17","v":0}]
[]
[null,"Totale breedte/hoogte 4",null,{"$f":"SUBTOTAL(9,D25:D1025)","v":0},{"$f":"SUBTOTAL(9,E25:E1025)","v":0},null,"Totale raillengte4 ",null,{"$f":"SUBTOTAL(9,I25:I1025)","v":0}]
[]
[null,"Vertrek","Artikelsoort","Breedte\n(cm)","Hoogte\n(cm)","Strak/\nBlijv.","Stel/\nStuk","Plooi","Rail-lngt. (cm)","Rail-\ntype","Rail-\nkleur","Bevest.","Mate-\nriaal","Bedie-\nning","Hoofdje","Artikelomschrijving","Merk","Hoeveelh.\nstof (cm)","Opmerkingen"]
[{"$f":"IF(B25=\"\",\"\",$L$18)","v":""}]
[{"$f":"IF(B26=\"\",\"\",$L$18)","v":""}]
[""]
[""]
[""]
[""]
[""]
[""]
[""]
[""]
[""]
[""]
[""]
[""]
[""]
[""]
[""]
[""]
[""]
[""]
[""]
[""]
[""]
[""]
[""]
[""]
[""]
[""]
[""]
[""]
[""]
[""]
[""]
[""]
[""]
[""]
[""]
[""]
[""]
[""]
[""]
[""]
[""]
[""]
[""]
[""]
[""]
[""]
[""]
[""]
[""]
[""]
[""]
[""]
[""]
[""]
[""]
[""]
[""]
[""]
[""]
[""]
[""]
[""]
[""]
[{"$f":"IF(B90=\"\",\"\",$L$18)","v":""}]
[""]
[""]
[""]
[""]
[""]
[""]
[""]
[""]
[""]
[""]
[""]
[""]
[""]
[""]
[""]
[""]
[""]
[""]
[""]
[""]
[""]
[""]
[""]
[""]
[""]
[""]
[""]
[""]
[""]
[""]
[""]
[""]
[""]
[""]
[""]

{"sheet":"Tijd","index":3,"n_rows":96,"n_cols":1,"rows_kept":96,"cut":false,"hidden":true,"merged":[]}
["00:00:00"]
["00:15:00"]
["00:30:00"]
["00:45:00"]
["01:00:00"]
["01:15:00"]
["01:30:00"]
["01:45:00"]
["02:00:00"]
["02:15:00"]
["02:30:00"]
["02:45:00"]
["03:00:00"]
["03:15:00"]
["03:30:00"]
["03:45:00"]
["04:00:00"]
["04:15:00"]
["04:30:00"]
["04:45:00"]
["05:00:00"]
["05:15:00"]
["05:30:00"]
["05:45:00"]
["06:00:00"]
["06:15:00"]
["06:30:00"]
["06:45:00"]
["07:00:00"]
["07:15:00"]
["07:30:00"]
["07:45:00"]
["08:00:00"]
["08:15:00"]
["08:30:00"]
["08:45:00"]
["09:00:00"]
["09:15:00"]
["09:30:00"]
["09:45:00"]
["10:00:00"]
["10:15:00"]
["10:30:00"]
["10:45:00"]
["11:00:00"]
["11:15:00"]
["11:30:00"]
["11:45:00"]
["12:00:00"]
["12:15:00"]
["12:30:00"]
["12:45:00"]
["13:00:00"]
["13:15:00"]
["13:30:00"]
["13:45:00"]
["14:00:00"]
["14:15:00"]
["14:30:00"]
["14:45:00"]
["15:00:00"]
["15:15:00"]
["15:30:00"]
["15:45:00"]
["16:00:00"]
["16:15:00"]
["16:30:00"]
["16:45:00"]
["17:00:00"]
["17:15:00"]
["17:30:00"]
["17:45:00"]
["18:00:00"]
["18:15:00"]
["18:30:00"]
["18:45:00"]
["19:00:00"]
["19:15:00"]
["19:30:00"]
["19:45:00"]
["20:00:00"]
["20:15:00"]
["20:30:00"]
["20:45:00"]
["21:00:00"]
["21:15:00"]
["21:30:00"]
["21:45:00"]
["22:00:00"]
["22:15:00"]
["22:30:00"]
["22:45:00"]
["23:00:00"]
["23:15:00"]
["23:30:00"]
["23:45:00"]

{"sheet":"Offerte goederen","index":4,"n_rows":125,"n_cols":25,"rows_kept":125,"cut":false,"hidden":true,"merged":[[21,1,21,2],[21,5,21,7],[9,2,9,7],[11,3,11,7],[12,3,12,7],[14,2,14,3],[15,2,15,3],[17,2,17,7],[17,15,17,18],[18,15,18,18],[19,15,19,18],[19,20,19,22],[8,2,8,7],[17,20,17,22],[18,20,18,22],[14,6,14,7],[15,6,15,7],[18,2,18,7],[19,2,19,7],[2,4,2,5],[4,4,4,7],[5,2,5,7],[6,2,6,7],[7,3,7,7]]}
[]
[null,null,"Offerte / Goederen"]
[]
[null,null,"Aanhef","Voorl.","Achternaam"]
[null,"Naam klant/contactpers.:",{"$f":"Inmeetformulier!C5","v":0},{"$f":"Inmeetformulier!D5","v":0},{"$f":"Inmeetformulier!E5","v":0}]
[null,"Organisatie:",{"$f":"Inmeetformulier!C6","v":0}]
[null,"Montage-adres:",{"$f":"Inmeetformulier!C7","v":0}]
[null,"Postcode/Wplts.:",{"$f":"Inmeetformulier!C8","v":0},{"$f":"Inmeetformulier!D8","v":0}]
[null,"Land:",{"$f":"Inmeetformulier!C9","v":0}]
[null,"E-mailadres:",{"$f":"Inmeetformulier!C10","v":0}]
[null,null,"Landcode","Tel.nr."]
[null,"Telefoon 1:",{"$f":"Inmeetformulier!C12","v":0},{"$f":"Inmeetformulier!D12","v":0}]
[null,"Telefoon 2:",{"$f":"Inmeetformulier!C13","v":0},{"$f":"Inmeetformulier!D13","v":0}]
[]
[null,"Ingemeten op (1):",{"$f":"Inmeetformulier!C15","v":"00:00:00"},null,null,"Offertedatum: "]
[null,"Ingemeten op (2):",{"$f":"Inmeetformulier!C16","v":"00:00:00"},null,null,"Geldig t/m: ",{"$f":"IF(G15=\"\",\"\",EDATE(G15,1))","v":""}]
[]
[null,"Projectomschrijving klant:",{"$f":"Inmeetformulier!C18","v":0},null,null,null,null,null,null,null,null,null,null,null,null,{"$f":"IF(X19=TRUE,\"Totaalbedrag goederen (excl. BTW): \",\"Totaalbedrag goederen (BTW verlegd): \")","v":"Totaalbedrag goederen (excl. BTW): "},null,null,null,null,{"$f":"SUM($W25:$W125)","v":0}]
[null,null,{"$f":"Inmeetformulier!C19","v":0},null,null,null,null,null,null,null,null,null,null,null,null,{"$f":"IF(X19=TRUE,CONCATENATE(\"+ BTW (\",100*Formulierdata!A29,\"%): \"),\"\")","v":"+ BTW (21%): "},null,null,null,null,{"$f":"IF(X19=TRUE,Formulierdata!A29*U18,\"\")","v":0},null,null,true]
[null,null,{"$f":"Inmeetformulier!C20","v":0},null,null,null,null,null,null,null,null,null,null,null,null,{"$f":"IF(X19=TRUE,\"Totaalbedrag goederen (incl. BTW): \",\"\")","v":"Totaalbedrag goederen (incl. BTW): "},null,null,null,null,{"$f":"IF(X19=TRUE,SUM(U18:W19),\"\")","v":0}]
[]
[null,null,null,null,null,null,null,null,null,null,null,null,null,null,null,null,null,null,null,null,null,null,2]
[]
[null,"Vertrek","Artikelsoort","B (cm)","H (cm)","Strak/Blijv.","Stel/Stuk","Plooi","Raillngt.","Railtype","Railkleur","Bevest.","Bediening","Artikelomschrijving","Merk","Opmerkingen",null,{"$f":"IF($W$22=1,\"Prijs       (incl. BTW)\",\"Prijs       (excl. BTW)\")","v":"Prijs       (excl. BTW)"},"per",null,"Aantal\neenh.",null,"Bedrag\n(excl. BTW)",null,"Bedrag\n(incl. BTW)"]
[null,{"$f":"Inmeetformulier!B25","v":0},{"$f":"Inmeetformulier!C25","v":0},{"$f":"Inmeetformulier!D25","v":0},{"$f":"Inmeetformulier!E25","v":0},{"$f":"Inmeetformulier!F25","v":0},{"$f":"Inmeetformulier!G25","v":0},{"$f":"Inmeetformulier!H25","v":0},{"$f":"Inmeetformulier!I25","v":0},{"$f":"Inmeetformulier!J25","v":0},{"$f":"Inmeetformulier!K25","v":0},{"$f":"Inmeetformulier!L25","v":0},{"$f":"Inmeetformulier!N25","v":0},{"$f":"Inmeetformulier!P25","v":0},{"$f":"Inmeetformulier!Q25","v":0},{"$f":"Inmeetformulier!S25","v":0},null,null,null,null,null,null,{"$f":"IF(Y25=\"\",\"\",(1/(1+Formulierdata!$A$29))*Y25)","v":""},null,{"$f":"IF($W$22=1,IF(R25=\"\",\"\",IF(OR(U25=\"\",U25=0,U25=1),R25,R25*U25)),IF(R25=\"\",\"\",IF(OR(U25=\"\",U25=0,U25=1),R25*(1+Formulierdata!$A$29),R25*(1+Formulierdata!$A$29)*U25)))","v":""}]
[null,{"$f":"Inmeetformulier!B26","v":0},{"$f":"Inmeetformulier!C26","v":0},{"$f":"Inmeetformulier!D26","v":0},{"$f":"Inmeetformulier!E26","v":0},{"$f":"Inmeetformulier!F26","v":0},{"$f":"Inmeetformulier!G26","v":0},{"$f":"Inmeetformulier!H26","v":0},{"$f":"Inmeetformulier!I26","v":0},{"$f":"Inmeetformulier!J26","v":0},{"$f":"Inmeetformulier!K26","v":0},{"$f":"Inmeetformulier!L26","v":0},{"$f":"Inmeetformulier!N26","v":0},{"$f":"Inmeetformulier!P26","v":0},{"$f":"Inmeetformulier!Q26","v":0},{"$f":"Inmeetformulier!S26","v":0},null,null,null,null,null,null,{"$f":"IF(Y26=\"\",\"\",(1/(1+Formulierdata!$A$29))*Y26)","v":""},null,{"$f":"IF($W$22=1,IF(R26=\"\",\"\",IF(OR(U26=\"\",U26=0,U26=1),R26,R26*U26)),IF(R26=\"\",\"\",IF(OR(U26=\"\",U26=0,U26=1),R26*(1+Formulierdata!$A$29),R26*(1+Formulierdata!$A$29)*U26)))","v":""}]
[null,{"$f":"Inmeetformulier!B27","v":0},{"$f":"Inmeetformulier!C27","v":0},{"$f":"Inmeetformulier!D27","v":0},{"$f":"Inmeetformulier!E27","v":0},{"$f":"Inmeetformulier!F27","v":0},{"$f":"Inmeetformulier!G27","v":0},{"$f":"Inmeetformulier!H27","v":0},{"$f":"Inmeetformulier!I27","v":0},{"$f":"Inmeetformulier!J27","v":0},{"$f":"Inmeetformulier!K27","v":0},{"$f":"Inmeetformulier!L27","v":0},{"$f":"Inmeetformulier!N27","v":0},{"$f":"Inmeetformulier!P27","v":0},{"$f":"Inmeetformulier!Q27","v":0},{"$f":"Inmeetformulier!S27","v":0},null,null,null,null,null,null,{"$f":"IF(Y27=\"\",\"\",(1/(1+Formulierdata!$A$29))*Y27)","v":""},null,{"$f":"IF($W$22=1,IF(R27=\"\",\"\",IF(OR(U27=\"\",U27=0,U27=1),R27,R27*U27)),IF(R27=\"\",\"\",IF(OR(U27=\"\",U27=0,U27=1),R27*(1+Formulierdata!$A$29),R27*(1+Formulierdata!$A$29)*U27)))","v":""}]
[null,{"$f":"Inmeetformulier!B28","v":0},{"$f":"Inmeetformulier!C28","v":0},{"$f":"Inmeetformulier!D28","v":0},{"$f":"Inmeetformulier!E28","v":0},{"$f":"Inmeetformulier!F28","v":0},{"$f":"Inmeetformulier!G28","v":0},{"$f":"Inmeetformulier!H28","v":0},{"$f":"Inmeetformulier!I28","v":0},{"$f":"Inmeetformulier!J28","v":0},{"$f":"Inmeetformulier!K28","v":0},{"$f":"Inmeetformulier!L28","v":0},{"$f":"Inmeetformulier!N28","v":0},{"$f":"Inmeetformulier!P28","v":0},{"$f":"Inmeetformulier!Q28","v":0},{"$f":"Inmeetformulier!S28","v":0},null,null,null,null,null,null,{"$f":"IF(Y28=\"\",\"\",(1/(1+Formulierdata!$A$29))*Y28)","v":""},null,{"$f":"IF($W$22=1,IF(R28=\"\",\"\",IF(OR(U28=\"\",U28=0,U28=1),R28,R28*U28)),IF(R28=\"\",\"\",IF(OR(U28=\"\",U28=0,U28=1),R28*(1+Formulierdata!$A$29),R28*(1+Formulierdata!$A$29)*U28)))","v":""}]
[null,{"$f":"Inmeetformulier!B29","v":0},{"$f":"Inmeetformulier!C29","v":0},{"$f":"Inmeetformulier!D29","v":0},{"$f":"Inmeetformulier!E29","v":0},{"$f":"Inmeetformulier!F29","v":0},{"$f":"Inmeetformulier!G29","v":0},{"$f":"Inmeetformulier!H29","v":0},{"$f":"Inmeetformulier!I29","v":0},{"$f":"Inmeetformulier!J29","v":0},{"$f":"Inmeetformulier!K29","v":0},{"$f":"Inmeetformulier!L29","v":0},{"$f":"Inmeetformulier!N29","v":0},{"$f":"Inmeetformulier!P29","v":0},{"$f":"Inmeetformulier!Q29","v":0},{"$f":"Inmeetformulier!S29","v":0},null,null,null,null,null,null,{"$f":"IF(Y29=\"\",\"\",(1/(1+Formulierdata!$A$29))*Y29)","v":""},null,{"$f":"IF($W$22=1,IF(R29=\"\",\"\",IF(OR(U29=\"\",U29=0,U29=1),R29,R29*U29)),IF(R29=\"\",\"\",IF(OR(U29=\"\",U29=0,U29=1),R29*(1+Formulierdata!$A$29),R29*(1+Formulierdata!$A$29)*U29)))","v":""}]
[null,{"$f":"Inmeetformulier!B30","v":0},{"$f":"Inmeetformulier!C30","v":0},{"$f":"Inmeetformulier!D30","v":0},{"$f":"Inmeetformulier!E30","v":0},{"$f":"Inmeetformulier!F30","v":0},{"$f":"Inmeetformulier!G30","v":0},{"$f":"Inmeetformulier!H30","v":0},{"$f":"Inmeetformulier!I30","v":0},{"$f":"Inmeetformulier!J30","v":0},{"$f":"Inmeetformulier!K30","v":0},{"$f":"Inmeetformulier!L30","v":0},{"$f":"Inmeetformulier!N30","v":0},{"$f":"Inmeetformulier!P30","v":0},{"$f":"Inmeetformulier!Q30","v":0},{"$f":"Inmeetformulier!S30","v":0},null,null,null,null,null,null,{"$f":"IF(Y30=\"\",\"\",(1/(1+Formulierdata!$A$29))*Y30)","v":""},null,{"$f":"IF($W$22=1,IF(R30=\"\",\"\",IF(OR(U30=\"\",U30=0,U30=1),R30,R30*U30)),IF(R30=\"\",\"\",IF(OR(U30=\"\",U30=0,U30=1),R30*(1+Formulierdata!$A$29),R30*(1+Formulierdata!$A$29)*U30)))","v":""}]
[null,{"$f":"Inmeetformulier!B31","v":0},{"$f":"Inmeetformulier!C31","v":0},{"$f":"Inmeetformulier!D31","v":0},{"$f":"Inmeetformulier!E31","v":0},{"$f":"Inmeetformulier!F31","v":0},{"$f":"Inmeetformulier!G31","v":0},{"$f":"Inmeetformulier!H31","v":0},{"$f":"Inmeetformulier!I31","v":0},{"$f":"Inmeetformulier!J31","v":0},{"$f":"Inmeetformulier!K31","v":0},{"$f":"Inmeetformulier!L31","v":0},{"$f":"Inmeetformulier!N31","v":0},{"$f":"Inmeetformulier!P31","v":0},{"$f":"Inmeetformulier!Q31","v":0},{"$f":"Inmeetformulier!S31","v":0},null,null,null,null,null,null,{"$f":"IF(Y31=\"\",\"\",(1/(1+Formulierdata!$A$29))*Y31)","v":""},null,{"$f":"IF($W$22=1,IF(R31=\"\",\"\",IF(OR(U31=\"\",U31=0,U31=1),R31,R31*U31)),IF(R31=\"\",\"\",IF(OR(U31=\"\",U31=0,U31=1),R31*(1+Formulierdata!$A$29),R31*(1+Formulierdata!$A$29)*U31)))","v":""}]
[null,{"$f":"Inmeetformulier!B32","v":0},{"$f":"Inmeetformulier!C32","v":0},{"$f":"Inmeetformulier!D32","v":0},{"$f":"Inmeetformulier!E32","v":0},{"$f":"Inmeetformulier!F32","v":0},{"$f":"Inmeetformulier!G32","v":0},{"$f":"Inmeetformulier!H32","v":0},{"$f":"Inmeetformulier!I32","v":0},{"$f":"Inmeetformulier!J32","v":0},{"$f":"Inmeetformulier!K32","v":0},{"$f":"Inmeetformulier!L32","v":0},{"$f":"Inmeetformulier!N32","v":0},{"$f":"Inmeetformulier!P32","v":0},{"$f":"Inmeetformulier!Q32","v":0},{"$f":"Inmeetformulier!S32","v":0},null,null,null,null,null,null,{"$f":"IF(Y32=\"\",\"\",(1/(1+Formulierdata!$A$29))*Y32)","v":""},null,{"$f":"IF($W$22=1,IF(R32=\"\",\"\",IF(OR(U32=\"\",U32=0,U32=1),R32,R32*U32)),IF(R32=\"\",\"\",IF(OR(U32=\"\",U32=0,U32=1),R32*(1+Formulierdata!$A$29),R32*(1+Formulierdata!$A$29)*U32)))","v":""}]
[null,{"$f":"Inmeetformulier!B33","v":0},{"$f":"Inmeetformulier!C33","v":0},{"$f":"Inmeetformulier!D33","v":0},{"$f":"Inmeetformulier!E33","v":0},{"$f":"Inmeetformulier!F33","v":0},{"$f":"Inmeetformulier!G33","v":0},{"$f":"Inmeetformulier!H33","v":0},{"$f":"Inmeetformulier!I33","v":0},{"$f":"Inmeetformulier!J33","v":0},{"$f":"Inmeetformulier!K33","v":0},{"$f":"Inmeetformulier!L33","v":0},{"$f":"Inmeetformulier!N33","v":0},{"$f":"Inmeetformulier!P33","v":0},{"$f":"Inmeetformulier!Q33","v":0},{"$f":"Inmeetformulier!S33","v":0},null,null,null,null,null,null,{"$f":"IF(Y33=\"\",\"\",(1/(1+Formulierdata!$A$29))*Y33)","v":""},null,{"$f":"IF($W$22=1,IF(R33=\"\",\"\",IF(OR(U33=\"\",U33=0,U33=1),R33,R33*U33)),IF(R33=\"\",\"\",IF(OR(U33=\"\",U33=0,U33=1),R33*(1+Formulierdata!$A$29),R33*(1+Formulierdata!$A$29)*U33)))","v":""}]
[null,{"$f":"Inmeetformulier!B34","v":0},{"$f":"Inmeetformulier!C34","v":0},{"$f":"Inmeetformulier!D34","v":0},{"$f":"Inmeetformulier!E34","v":0},{"$f":"Inmeetformulier!F34","v":0},{"$f":"Inmeetformulier!G34","v":0},{"$f":"Inmeetformulier!H34","v":0},{"$f":"Inmeetformulier!I34","v":0},{"$f":"Inmeetformulier!J34","v":0},{"$f":"Inmeetformulier!K34","v":0},{"$f":"Inmeetformulier!L34","v":0},{"$f":"Inmeetformulier!N34","v":0},{"$f":"Inmeetformulier!P34","v":0},{"$f":"Inmeetformulier!Q34","v":0},{"$f":"Inmeetformulier!S34","v":0},null,null,null,null,null,null,{"$f":"IF(Y34=\"\",\"\",(1/(1+Formulierdata!$A$29))*Y34)","v":""},null,{"$f":"IF($W$22=1,IF(R34=\"\",\"\",IF(OR(U34=\"\",U34=0,U34=1),R34,R34*U34)),IF(R34=\"\",\"\",IF(OR(U34=\"\",U34=0,U34=1),R34*(1+Formulierdata!$A$29),R34*(1+Formulierdata!$A$29)*U34)))","v":""}]
[null,{"$f":"Inmeetformulier!B35","v":0},{"$f":"Inmeetformulier!C35","v":0},{"$f":"Inmeetformulier!D35","v":0},{"$f":"Inmeetformulier!E35","v":0},{"$f":"Inmeetformulier!F35","v":0},{"$f":"Inmeetformulier!G35","v":0},{"$f":"Inmeetformulier!H35","v":0},{"$f":"Inmeetformulier!I35","v":0},{"$f":"Inmeetformulier!J35","v":0},{"$f":"Inmeetformulier!K35","v":0},{"$f":"Inmeetformulier!L35","v":0},{"$f":"Inmeetformulier!N35","v":0},{"$f":"Inmeetformulier!P35","v":0},{"$f":"Inmeetformulier!Q35","v":0},{"$f":"Inmeetformulier!S35","v":0},null,null,null,null,null,null,{"$f":"IF(Y35=\"\",\"\",(1/(1+Formulierdata!$A$29))*Y35)","v":""},null,{"$f":"IF($W$22=1,IF(R35=\"\",\"\",IF(OR(U35=\"\",U35=0,U35=1),R35,R35*U35)),IF(R35=\"\",\"\",IF(OR(U35=\"\",U35=0,U35=1),R35*(1+Formulierdata!$A$29),R35*(1+Formulierdata!$A$29)*U35)))","v":""}]
[null,{"$f":"Inmeetformulier!B36","v":0},{"$f":"Inmeetformulier!C36","v":0},{"$f":"Inmeetformulier!D36","v":0},{"$f":"Inmeetformulier!E36","v":0},{"$f":"Inmeetformulier!F36","v":0},{"$f":"Inmeetformulier!G36","v":0},{"$f":"Inmeetformulier!H36","v":0},{"$f":"Inmeetformulier!I36","v":0},{"$f":"Inmeetformulier!J36","v":0},{"$f":"Inmeetformulier!K36","v":0},{"$f":"Inmeetformulier!L36","v":0},{"$f":"Inmeetformulier!N36","v":0},{"$f":"Inmeetformulier!P36","v":0},{"$f":"Inmeetformulier!Q36","v":0},{"$f":"Inmeetformulier!S36","v":0},null,null,null,null,null,null,{"$f":"IF(Y36=\"\",\"\",(1/(1+Formulierdata!$A$29))*Y36)","v":""},null,{"$f":"IF($W$22=1,IF(R36=\"\",\"\",IF(OR(U36=\"\",U36=0,U36=1),R36,R36*U36)),IF(R36=\"\",\"\",IF(OR(U36=\"\",U36=0,U36=1),R36*(1+Formulierdata!$A$29),R36*(1+Formulierdata!$A$29)*U36)))","v":""}]
[null,{"$f":"Inmeetformulier!B37","v":0},{"$f":"Inmeetformulier!C37","v":0},{"$f":"Inmeetformulier!D37","v":0},{"$f":"Inmeetformulier!E37","v":0},{"$f":"Inmeetformulier!F37","v":0},{"$f":"Inmeetformulier!G37","v":0},{"$f":"Inmeetformulier!H37","v":0},{"$f":"Inmeetformulier!I37","v":0},{"$f":"Inmeetformulier!J37","v":0},{"$f":"Inmeetformulier!K37","v":0},{"$f":"Inmeetformulier!L37","v":0},{"$f":"Inmeetformulier!N37","v":0},{"$f":"Inmeetformulier!P37","v":0},{"$f":"Inmeetformulier!Q37","v":0},{"$f":"Inmeetformulier!S37","v":0},null,null,null,null,null,null,{"$f":"IF(Y37=\"\",\"\",(1/(1+Formulierdata!$A$29))*Y37)","v":""},null,{"$f":"IF($W$22=1,IF(R37=\"\",\"\",IF(OR(U37=\"\",U37=0,U37=1),R37,R37*U37)),IF(R37=\"\",\"\",IF(OR(U37=\"\",U37=0,U37=1),R37*(1+Formulierdata!$A$29),R37*(1+Formulierdata!$A$29)*U37)))","v":""}]
[null,{"$f":"Inmeetformulier!B38","v":0},{"$f":"Inmeetformulier!C38","v":0},{"$f":"Inmeetformulier!D38","v":0},{"$f":"Inmeetformulier!E38","v":0},{"$f":"Inmeetformulier!F38","v":0},{"$f":"Inmeetformulier!G38","v":0},{"$f":"Inmeetformulier!H38","v":0},{"$f":"Inmeetformulier!I38","v":0},{"$f":"Inmeetformulier!J38","v":0},{"$f":"Inmeetformulier!K38","v":0},{"$f":"Inmeetformulier!L38","v":0},{"$f":"Inmeetformulier!N38","v":0},{"$f":"Inmeetformulier!P38","v":0},{"$f":"Inmeetformulier!Q38","v":0},{"$f":"Inmeetformulier!S38","v":0},null,null,null,null,null,null,{"$f":"IF(Y38=\"\",\"\",(1/(1+Formulierdata!$A$29))*Y38)","v":""},null,{"$f":"IF($W$22=1,IF(R38=\"\",\"\",IF(OR(U38=\"\",U38=0,U38=1),R38,R38*U38)),IF(R38=\"\",\"\",IF(OR(U38=\"\",U38=0,U38=1),R38*(1+Formulierdata!$A$29),R38*(1+Formulierdata!$A$29)*U38)))","v":""}]
[null,{"$f":"Inmeetformulier!B39","v":0},{"$f":"Inmeetformulier!C39","v":0},{"$f":"Inmeetformulier!D39","v":0},{"$f":"Inmeetformulier!E39","v":0},{"$f":"Inmeetformulier!F39","v":0},{"$f":"Inmeetformulier!G39","v":0},{"$f":"Inmeetformulier!H39","v":0},{"$f":"Inmeetformulier!I39","v":0},{"$f":"Inmeetformulier!J39","v":0},{"$f":"Inmeetformulier!K39","v":0},{"$f":"Inmeetformulier!L39","v":0},{"$f":"Inmeetformulier!N39","v":0},{"$f":"Inmeetformulier!P39","v":0},{"$f":"Inmeetformulier!Q39","v":0},{"$f":"Inmeetformulier!S39","v":0},null,null,null,null,null,null,{"$f":"IF(Y39=\"\",\"\",(1/(1+Formulierdata!$A$29))*Y39)","v":""},null,{"$f":"IF($W$22=1,IF(R39=\"\",\"\",IF(OR(U39=\"\",U39=0,U39=1),R39,R39*U39)),IF(R39=\"\",\"\",IF(OR(U39=\"\",U39=0,U39=1),R39*(1+Formulierdata!$A$29),R39*(1+Formulierdata!$A$29)*U39)))","v":""}]
[null,{"$f":"Inmeetformulier!B40","v":0},{"$f":"Inmeetformulier!C40","v":0},{"$f":"Inmeetformulier!D40","v":0},{"$f":"Inmeetformulier!E40","v":0},{"$f":"Inmeetformulier!F40","v":0},{"$f":"Inmeetformulier!G40","v":0},{"$f":"Inmeetformulier!H40","v":0},{"$f":"Inmeetformulier!I40","v":0},{"$f":"Inmeetformulier!J40","v":0},{"$f":"Inmeetformulier!K40","v":0},{"$f":"Inmeetformulier!L40","v":0},{"$f":"Inmeetformulier!N40","v":0},{"$f":"Inmeetformulier!P40","v":0},{"$f":"Inmeetformulier!Q40","v":0},{"$f":"Inmeetformulier!S40","v":0},null,null,null,null,null,null,{"$f":"IF(Y40=\"\",\"\",(1/(1+Formulierdata!$A$29))*Y40)","v":""},null,{"$f":"IF($W$22=1,IF(R40=\"\",\"\",IF(OR(U40=\"\",U40=0,U40=1),R40,R40*U40)),IF(R40=\"\",\"\",IF(OR(U40=\"\",U40=0,U40=1),R40*(1+Formulierdata!$A$29),R40*(1+Formulierdata!$A$29)*U40)))","v":""}]
[null,{"$f":"Inmeetformulier!B41","v":0},{"$f":"Inmeetformulier!C41","v":0},{"$f":"Inmeetformulier!D41","v":0},{"$f":"Inmeetformulier!E41","v":0},{"$f":"Inmeetformulier!F41","v":0},{"$f":"Inmeetformulier!G41","v":0},{"$f":"Inmeetformulier!H41","v":0},{"$f":"Inmeetformulier!I41","v":0},{"$f":"Inmeetformulier!J41","v":0},{"$f":"Inmeetformulier!K41","v":0},{"$f":"Inmeetformulier!L41","v":0},{"$f":"Inmeetformulier!N41","v":0},{"$f":"Inmeetformulier!P41","v":0},{"$f":"Inmeetformulier!Q41","v":0},{"$f":"Inmeetformulier!S41","v":0},null,null,null,null,null,null,{"$f":"IF(Y41=\"\",\"\",(1/(1+Formulierdata!$A$29))*Y41)","v":""},null,{"$f":"IF($W$22=1,IF(R41=\"\",\"\",IF(OR(U41=\"\",U41=0,U41=1),R41,R41*U41)),IF(R41=\"\",\"\",IF(OR(U41=\"\",U41=0,U41=1),R41*(1+Formulierdata!$A$29),R41*(1+Formulierdata!$A$29)*U41)))","v":""}]
[null,{"$f":"Inmeetformulier!B42","v":0},{"$f":"Inmeetformulier!C42","v":0},{"$f":"Inmeetformulier!D42","v":0},{"$f":"Inmeetformulier!E42","v":0},{"$f":"Inmeetformulier!F42","v":0},{"$f":"Inmeetformulier!G42","v":0},{"$f":"Inmeetformulier!H42","v":0},{"$f":"Inmeetformulier!I42","v":0},{"$f":"Inmeetformulier!J42","v":0},{"$f":"Inmeetformulier!K42","v":0},{"$f":"Inmeetformulier!L42","v":0},{"$f":"Inmeetformulier!N42","v":0},{"$f":"Inmeetformulier!P42","v":0},{"$f":"Inmeetformulier!Q42","v":0},{"$f":"Inmeetformulier!S42","v":0},null,null,null,null,null,null,{"$f":"IF(Y42=\"\",\"\",(1/(1+Formulierdata!$A$29))*Y42)","v":""},null,{"$f":"IF($W$22=1,IF(R42=\"\",\"\",IF(OR(U42=\"\",U42=0,U42=1),R42,R42*U42)),IF(R42=\"\",\"\",IF(OR(U42=\"\",U42=0,U42=1),R42*(1+Formulierdata!$A$29),R42*(1+Formulierdata!$A$29)*U42)))","v":""}]
[null,{"$f":"Inmeetformulier!B43","v":0},{"$f":"Inmeetformulier!C43","v":0},{"$f":"Inmeetformulier!D43","v":0},{"$f":"Inmeetformulier!E43","v":0},{"$f":"Inmeetformulier!F43","v":0},{"$f":"Inmeetformulier!G43","v":0},{"$f":"Inmeetformulier!H43","v":0},{"$f":"Inmeetformulier!I43","v":0},{"$f":"Inmeetformulier!J43","v":0},{"$f":"Inmeetformulier!K43","v":0},{"$f":"Inmeetformulier!L43","v":0},{"$f":"Inmeetformulier!N43","v":0},{"$f":"Inmeetformulier!P43","v":0},{"$f":"Inmeetformulier!Q43","v":0},{"$f":"Inmeetformulier!S43","v":0},null,null,null,null,null,null,{"$f":"IF(Y43=\"\",\"\",(1/(1+Formulierdata!$A$29))*Y43)","v":""},null,{"$f":"IF($W$22=1,IF(R43=\"\",\"\",IF(OR(U43=\"\",U43=0,U43=1),R43,R43*U43)),IF(R43=\"\",\"\",IF(OR(U43=\"\",U43=0,U43=1),R43*(1+Formulierdata!$A$29),R43*(1+Formulierdata!$A$29)*U43)))","v":""}]
[null,{"$f":"Inmeetformulier!B44","v":0},{"$f":"Inmeetformulier!C44","v":0},{"$f":"Inmeetformulier!D44","v":0},{"$f":"Inmeetformulier!E44","v":0},{"$f":"Inmeetformulier!F44","v":0},{"$f":"Inmeetformulier!G44","v":0},{"$f":"Inmeetformulier!H44","v":0},{"$f":"Inmeetformulier!I44","v":0},{"$f":"Inmeetformulier!J44","v":0},{"$f":"Inmeetformulier!K44","v":0},{"$f":"Inmeetformulier!L44","v":0},{"$f":"Inmeetformulier!N44","v":0},{"$f":"Inmeetformulier!P44","v":0},{"$f":"Inmeetformulier!Q44","v":0},{"$f":"Inmeetformulier!S44","v":0},null,null,null,null,null,null,{"$f":"IF(Y44=\"\",\"\",(1/(1+Formulierdata!$A$29))*Y44)","v":""},null,{"$f":"IF($W$22=1,IF(R44=\"\",\"\",IF(OR(U44=\"\",U44=0,U44=1),R44,R44*U44)),IF(R44=\"\",\"\",IF(OR(U44=\"\",U44=0,U44=1),R44*(1+Formulierdata!$A$29),R44*(1+Formulierdata!$A$29)*U44)))","v":""}]
[null,{"$f":"Inmeetformulier!B45","v":0},{"$f":"Inmeetformulier!C45","v":0},{"$f":"Inmeetformulier!D45","v":0},{"$f":"Inmeetformulier!E45","v":0},{"$f":"Inmeetformulier!F45","v":0},{"$f":"Inmeetformulier!G45","v":0},{"$f":"Inmeetformulier!H45","v":0},{"$f":"Inmeetformulier!I45","v":0},{"$f":"Inmeetformulier!J45","v":0},{"$f":"Inmeetformulier!K45","v":0},{"$f":"Inmeetformulier!L45","v":0},{"$f":"Inmeetformulier!N45","v":0},{"$f":"Inmeetformulier!P45","v":0},{"$f":"Inmeetformulier!Q45","v":0},{"$f":"Inmeetformulier!S45","v":0},null,null,null,null,null,null,{"$f":"IF(Y45=\"\",\"\",(1/(1+Formulierdata!$A$29))*Y45)","v":""},null,{"$f":"IF($W$22=1,IF(R45=\"\",\"\",IF(OR(U45=\"\",U45=0,U45=1),R45,R45*U45)),IF(R45=\"\",\"\",IF(OR(U45=\"\",U45=0,U45=1),R45*(1+Formulierdata!$A$29),R45*(1+Formulierdata!$A$29)*U45)))","v":""}]
[null,{"$f":"Inmeetformulier!B46","v":0},{"$f":"Inmeetformulier!C46","v":0},{"$f":"Inmeetformulier!D46","v":0},{"$f":"Inmeetformulier!E46","v":0},{"$f":"Inmeetformulier!F46","v":0},{"$f":"Inmeetformulier!G46","v":0},{"$f":"Inmeetformulier!H46","v":0},{"$f":"Inmeetformulier!I46","v":0},{"$f":"Inmeetformulier!J46","v":0},{"$f":"Inmeetformulier!K46","v":0},{"$f":"Inmeetformulier!L46","v":0},{"$f":"Inmeetformulier!N46","v":0},{"$f":"Inmeetformulier!P46","v":0},{"$f":"Inmeetformulier!Q46","v":0},{"$f":"Inmeetformulier!S46","v":0},null,null,null,null,null,null,{"$f":"IF(Y46=\"\",\"\",(1/(1+Formulierdata!$A$29))*Y46)","v":""},null,{"$f":"IF($W$22=1,IF(R46=\"\",\"\",IF(OR(U46=\"\",U46=0,U46=1),R46,R46*U46)),IF(R46=\"\",\"\",IF(OR(U46=\"\",U46=0,U46=1),R46*(1+Formulierdata!$A$29),R46*(1+Formulierdata!$A$29)*U46)))","v":""}]
[null,{"$f":"Inmeetformulier!B47","v":0},{"$f":"Inmeetformulier!C47","v":0},{"$f":"Inmeetformulier!D47","v":0},{"$f":"Inmeetformulier!E47","v":0},{"$f":"Inmeetformulier!F47","v":0},{"$f":"Inmeetformulier!G47","v":0},{"$f":"Inmeetformulier!H47","v":0},{"$f":"Inmeetformulier!I47","v":0},{"$f":"Inmeetformulier!J47","v":0},{"$f":"Inmeetformulier!K47","v":0},{"$f":"Inmeetformulier!L47","v":0},{"$f":"Inmeetformulier!N47","v":0},{"$f":"Inmeetformulier!P47","v":0},{"$f":"Inmeetformulier!Q47","v":0},{"$f":"Inmeetformulier!S47","v":0},null,null,null,null,null,null,{"$f":"IF(Y47=\"\",\"\",(1/(1+Formulierdata!$A$29))*Y47)","v":""},null,{"$f":"IF($W$22=1,IF(R47=\"\",\"\",IF(OR(U47=\"\",U47=0,U47=1),R47,R47*U47)),IF(R47=\"\",\"\",IF(OR(U47=\"\",U47=0,U47=1),R47*(1+Formulierdata!$A$29),R47*(1+Formulierdata!$A$29)*U47)))","v":""}]
[null,{"$f":"Inmeetformulier!B48","v":0},{"$f":"Inmeetformulier!C48","v":0},{"$f":"Inmeetformulier!D48","v":0},{"$f":"Inmeetformulier!E48","v":0},{"$f":"Inmeetformulier!F48","v":0},{"$f":"Inmeetformulier!G48","v":0},{"$f":"Inmeetformulier!H48","v":0},{"$f":"Inmeetformulier!I48","v":0},{"$f":"Inmeetformulier!J48","v":0},{"$f":"Inmeetformulier!K48","v":0},{"$f":"Inmeetformulier!L48","v":0},{"$f":"Inmeetformulier!N48","v":0},{"$f":"Inmeetformulier!P48","v":0},{"$f":"Inmeetformulier!Q48","v":0},{"$f":"Inmeetformulier!S48","v":0},null,null,null,null,null,null,{"$f":"IF(Y48=\"\",\"\",(1/(1+Formulierdata!$A$29))*Y48)","v":""},null,{"$f":"IF($W$22=1,IF(R48=\"\",\"\",IF(OR(U48=\"\",U48=0,U48=1),R48,R48*U48)),IF(R48=\"\",\"\",IF(OR(U48=\"\",U48=0,U48=1),R48*(1+Formulierdata!$A$29),R48*(1+Formulierdata!$A$29)*U48)))","v":""}]
[null,{"$f":"Inmeetformulier!B49","v":0},{"$f":"Inmeetformulier!C49","v":0},{"$f":"Inmeetformulier!D49","v":0},{"$f":"Inmeetformulier!E49","v":0},{"$f":"Inmeetformulier!F49","v":0},{"$f":"Inmeetformulier!G49","v":0},{"$f":"Inmeetformulier!H49","v":0},{"$f":"Inmeetformulier!I49","v":0},{"$f":"Inmeetformulier!J49","v":0},{"$f":"Inmeetformulier!K49","v":0},{"$f":"Inmeetformulier!L49","v":0},{"$f":"Inmeetformulier!N49","v":0},{"$f":"Inmeetformulier!P49","v":0},{"$f":"Inmeetformulier!Q49","v":0},{"$f":"Inmeetformulier!S49","v":0},null,null,null,null,null,null,{"$f":"IF(Y49=\"\",\"\",(1/(1+Formulierdata!$A$29))*Y49)","v":""},null,{"$f":"IF($W$22=1,IF(R49=\"\",\"\",IF(OR(U49=\"\",U49=0,U49=1),R49,R49*U49)),IF(R49=\"\",\"\",IF(OR(U49=\"\",U49=0,U49=1),R49*(1+Formulierdata!$A$29),R49*(1+Formulierdata!$A$29)*U49)))","v":""}]
[null,{"$f":"Inmeetformulier!B50","v":0},{"$f":"Inmeetformulier!C50","v":0},{"$f":"Inmeetformulier!D50","v":0},{"$f":"Inmeetformulier!E50","v":0},{"$f":"Inmeetformulier!F50","v":0},{"$f":"Inmeetformulier!G50","v":0},{"$f":"Inmeetformulier!H50","v":0},{"$f":"Inmeetformulier!I50","v":0},{"$f":"Inmeetformulier!J50","v":0},{"$f":"Inmeetformulier!K50","v":0},{"$f":"Inmeetformulier!L50","v":0},{"$f":"Inmeetformulier!N50","v":0},{"$f":"Inmeetformulier!P50","v":0},{"$f":"Inmeetformulier!Q50","v":0},{"$f":"Inmeetformulier!S50","v":0},null,null,null,null,null,null,{"$f":"IF(Y50=\"\",\"\",(1/(1+Formulierdata!$A$29))*Y50)","v":""},null,{"$f":"IF($W$22=1,IF(R50=\"\",\"\",IF(OR(U50=\"\",U50=0,U50=1),R50,R50*U50)),IF(R50=\"\",\"\",IF(OR(U50=\"\",U50=0,U50=1),R50*(1+Formulierdata!$A$29),R50*(1+Formulierdata!$A$29)*U50)))","v":""}]
[null,{"$f":"Inmeetformulier!B51","v":0},{"$f":"Inmeetformulier!C51","v":0},{"$f":"Inmeetformulier!D51","v":0},{"$f":"Inmeetformulier!E51","v":0},{"$f":"Inmeetformulier!F51","v":0},{"$f":"Inmeetformulier!G51","v":0},{"$f":"Inmeetformulier!H51","v":0},{"$f":"Inmeetformulier!I51","v":0},{"$f":"Inmeetformulier!J51","v":0},{"$f":"Inmeetformulier!K51","v":0},{"$f":"Inmeetformulier!L51","v":0},{"$f":"Inmeetformulier!N51","v":0},{"$f":"Inmeetformulier!P51","v":0},{"$f":"Inmeetformulier!Q51","v":0},{"$f":"Inmeetformulier!S51","v":0},null,null,null,null,null,null,{"$f":"IF(Y51=\"\",\"\",(1/(1+Formulierdata!$A$29))*Y51)","v":""},null,{"$f":"IF($W$22=1,IF(R51=\"\",\"\",IF(OR(U51=\"\",U51=0,U51=1),R51,R51*U51)),IF(R51=\"\",\"\",IF(OR(U51=\"\",U51=0,U51=1),R51*(1+Formulierdata!$A$29),R51*(1+Formulierdata!$A$29)*U51)))","v":""}]
[null,{"$f":"Inmeetformulier!B52","v":0},{"$f":"Inmeetformulier!C52","v":0},{"$f":"Inmeetformulier!D52","v":0},{"$f":"Inmeetformulier!E52","v":0},{"$f":"Inmeetformulier!F52","v":0},{"$f":"Inmeetformulier!G52","v":0},{"$f":"Inmeetformulier!H52","v":0},{"$f":"Inmeetformulier!I52","v":0},{"$f":"Inmeetformulier!J52","v":0},{"$f":"Inmeetformulier!K52","v":0},{"$f":"Inmeetformulier!L52","v":0},{"$f":"Inmeetformulier!N52","v":0},{"$f":"Inmeetformulier!P52","v":0},{"$f":"Inmeetformulier!Q52","v":0},{"$f":"Inmeetformulier!S52","v":0},null,null,null,null,null,null,{"$f":"IF(Y52=\"\",\"\",(1/(1+Formulierdata!$A$29))*Y52)","v":""},null,{"$f":"IF($W$22=1,IF(R52=\"\",\"\",IF(OR(U52=\"\",U52=0,U52=1),R52,R52*U52)),IF(R52=\"\",\"\",IF(OR(U52=\"\",U52=0,U52=1),R52*(1+Formulierdata!$A$29),R52*(1+Formulierdata!$A$29)*U52)))","v":""}]
[null,{"$f":"Inmeetformulier!B53","v":0},{"$f":"Inmeetformulier!C53","v":0},{"$f":"Inmeetformulier!D53","v":0},{"$f":"Inmeetformulier!E53","v":0},{"$f":"Inmeetformulier!F53","v":0},{"$f":"Inmeetformulier!G53","v":0},{"$f":"Inmeetformulier!H53","v":0},{"$f":"Inmeetformulier!I53","v":0},{"$f":"Inmeetformulier!J53","v":0},{"$f":"Inmeetformulier!K53","v":0},{"$f":"Inmeetformulier!L53","v":0},{"$f":"Inmeetformulier!N53","v":0},{"$f":"Inmeetformulier!P53","v":0},{"$f":"Inmeetformulier!Q53","v":0},{"$f":"Inmeetformulier!S53","v":0},null,null,null,null,null,null,{"$f":"IF(Y53=\"\",\"\",(1/(1+Formulierdata!$A$29))*Y53)","v":""},null,{"$f":"IF($W$22=1,IF(R53=\"\",\"\",IF(OR(U53=\"\",U53=0,U53=1),R53,R53*U53)),IF(R53=\"\",\"\",IF(OR(U53=\"\",U53=0,U53=1),R53*(1+Formulierdata!$A$29),R53*(1+Formulierdata!$A$29)*U53)))","v":""}]
[null,{"$f":"Inmeetformulier!B54","v":0},{"$f":"Inmeetformulier!C54","v":0},{"$f":"Inmeetformulier!D54","v":0},{"$f":"Inmeetformulier!E54","v":0},{"$f":"Inmeetformulier!F54","v":0},{"$f":"Inmeetformulier!G54","v":0},{"$f":"Inmeetformulier!H54","v":0},{"$f":"Inmeetformulier!I54","v":0},{"$f":"Inmeetformulier!J54","v":0},{"$f":"Inmeetformulier!K54","v":0},{"$f":"Inmeetformulier!L54","v":0},{"$f":"Inmeetformulier!N54","v":0},{"$f":"Inmeetformulier!P54","v":0},{"$f":"Inmeetformulier!Q54","v":0},{"$f":"Inmeetformulier!S54","v":0},null,null,null,null,null,null,{"$f":"IF(Y54=\"\",\"\",(1/(1+Formulierdata!$A$29))*Y54)","v":""},null,{"$f":"IF($W$22=1,IF(R54=\"\",\"\",IF(OR(U54=\"\",U54=0,U54=1),R54,R54*U54)),IF(R54=\"\",\"\",IF(OR(U54=\"\",U54=0,U54=1),R54*(1+Formulierdata!$A$29),R54*(1+Formulierdata!$A$29)*U54)))","v":""}]
[null,{"$f":"Inmeetformulier!B55","v":0},{"$f":"Inmeetformulier!C55","v":0},{"$f":"Inmeetformulier!D55","v":0},{"$f":"Inmeetformulier!E55","v":0},{"$f":"Inmeetformulier!F55","v":0},{"$f":"Inmeetformulier!G55","v":0},{"$f":"Inmeetformulier!H55","v":0},{"$f":"Inmeetformulier!I55","v":0},{"$f":"Inmeetformulier!J55","v":0},{"$f":"Inmeetformulier!K55","v":0},{"$f":"Inmeetformulier!L55","v":0},{"$f":"Inmeetformulier!N55","v":0},{"$f":"Inmeetformulier!P55","v":0},{"$f":"Inmeetformulier!Q55","v":0},{"$f":"Inmeetformulier!S55","v":0},null,null,null,null,null,null,{"$f":"IF(Y55=\"\",\"\",(1/(1+Formulierdata!$A$29))*Y55)","v":""},null,{"$f":"IF($W$22=1,IF(R55=\"\",\"\",IF(OR(U55=\"\",U55=0,U55=1),R55,R55*U55)),IF(R55=\"\",\"\",IF(OR(U55=\"\",U55=0,U55=1),R55*(1+Formulierdata!$A$29),R55*(1+Formulierdata!$A$29)*U55)))","v":""}]
[null,{"$f":"Inmeetformulier!B56","v":0},{"$f":"Inmeetformulier!C56","v":0},{"$f":"Inmeetformulier!D56","v":0},{"$f":"Inmeetformulier!E56","v":0},{"$f":"Inmeetformulier!F56","v":0},{"$f":"Inmeetformulier!G56","v":0},{"$f":"Inmeetformulier!H56","v":0},{"$f":"Inmeetformulier!I56","v":0},{"$f":"Inmeetformulier!J56","v":0},{"$f":"Inmeetformulier!K56","v":0},{"$f":"Inmeetformulier!L56","v":0},{"$f":"Inmeetformulier!N56","v":0},{"$f":"Inmeetformulier!P56","v":0},{"$f":"Inmeetformulier!Q56","v":0},{"$f":"Inmeetformulier!S56","v":0},null,null,null,null,null,null,{"$f":"IF(Y56=\"\",\"\",(1/(1+Formulierdata!$A$29))*Y56)","v":""},null,{"$f":"IF($W$22=1,IF(R56=\"\",\"\",IF(OR(U56=\"\",U56=0,U56=1),R56,R56*U56)),IF(R56=\"\",\"\",IF(OR(U56=\"\",U56=0,U56=1),R56*(1+Formulierdata!$A$29),R56*(1+Formulierdata!$A$29)*U56)))","v":""}]
[null,{"$f":"Inmeetformulier!B57","v":0},{"$f":"Inmeetformulier!C57","v":0},{"$f":"Inmeetformulier!D57","v":0},{"$f":"Inmeetformulier!E57","v":0},{"$f":"Inmeetformulier!F57","v":0},{"$f":"Inmeetformulier!G57","v":0},{"$f":"Inmeetformulier!H57","v":0},{"$f":"Inmeetformulier!I57","v":0},{"$f":"Inmeetformulier!J57","v":0},{"$f":"Inmeetformulier!K57","v":0},{"$f":"Inmeetformulier!L57","v":0},{"$f":"Inmeetformulier!N57","v":0},{"$f":"Inmeetformulier!P57","v":0},{"$f":"Inmeetformulier!Q57","v":0},{"$f":"Inmeetformulier!S57","v":0},null,null,null,null,null,null,{"$f":"IF(Y57=\"\",\"\",(1/(1+Formulierdata!$A$29))*Y57)","v":""},null,{"$f":"IF($W$22=1,IF(R57=\"\",\"\",IF(OR(U57=\"\",U57=0,U57=1),R57,R57*U57)),IF(R57=\"\",\"\",IF(OR(U57=\"\",U57=0,U57=1),R57*(1+Formulierdata!$A$29),R57*(1+Formulierdata!$A$29)*U57)))","v":""}]
[null,{"$f":"Inmeetformulier!B58","v":0},{"$f":"Inmeetformulier!C58","v":0},{"$f":"Inmeetformulier!D58","v":0},{"$f":"Inmeetformulier!E58","v":0},{"$f":"Inmeetformulier!F58","v":0},{"$f":"Inmeetformulier!G58","v":0},{"$f":"Inmeetformulier!H58","v":0},{"$f":"Inmeetformulier!I58","v":0},{"$f":"Inmeetformulier!J58","v":0},{"$f":"Inmeetformulier!K58","v":0},{"$f":"Inmeetformulier!L58","v":0},{"$f":"Inmeetformulier!N58","v":0},{"$f":"Inmeetformulier!P58","v":0},{"$f":"Inmeetformulier!Q58","v":0},{"$f":"Inmeetformulier!S58","v":0},null,null,null,null,null,null,{"$f":"IF(Y58=\"\",\"\",(1/(1+Formulierdata!$A$29))*Y58)","v":""},null,{"$f":"IF($W$22=1,IF(R58=\"\",\"\",IF(OR(U58=\"\",U58=0,U58=1),R58,R58*U58)),IF(R58=\"\",\"\",IF(OR(U58=\"\",U58=0,U58=1),R58*(1+Formulierdata!$A$29),R58*(1+Formulierdata!$A$29)*U58)))","v":""}]
[null,{"$f":"Inmeetformulier!B59","v":0},{"$f":"Inmeetformulier!C59","v":0},{"$f":"Inmeetformulier!D59","v":0},{"$f":"Inmeetformulier!E59","v":0},{"$f":"Inmeetformulier!F59","v":0},{"$f":"Inmeetformulier!G59","v":0},{"$f":"Inmeetformulier!H59","v":0},{"$f":"Inmeetformulier!I59","v":0},{"$f":"Inmeetformulier!J59","v":0},{"$f":"Inmeetformulier!K59","v":0},{"$f":"Inmeetformulier!L59","v":0},{"$f":"Inmeetformulier!N59","v":0},{"$f":"Inmeetformulier!P59","v":0},{"$f":"Inmeetformulier!Q59","v":0},{"$f":"Inmeetformulier!S59","v":0},null,null,null,null,null,null,{"$f":"IF(Y59=\"\",\"\",(1/(1+Formulierdata!$A$29))*Y59)","v":""},null,{"$f":"IF($W$22=1,IF(R59=\"\",\"\",IF(OR(U59=\"\",U59=0,U59=1),R59,R59*U59)),IF(R59=\"\",\"\",IF(OR(U59=\"\",U59=0,U59=1),R59*(1+Formulierdata!$A$29),R59*(1+Formulierdata!$A$29)*U59)))","v":""}]
[null,{"$f":"Inmeetformulier!B60","v":0},{"$f":"Inmeetformulier!C60","v":0},{"$f":"Inmeetformulier!D60","v":0},{"$f":"Inmeetformulier!E60","v":0},{"$f":"Inmeetformulier!F60","v":0},{"$f":"Inmeetformulier!G60","v":0},{"$f":"Inmeetformulier!H60","v":0},{"$f":"Inmeetformulier!I60","v":0},{"$f":"Inmeetformulier!J60","v":0},{"$f":"Inmeetformulier!K60","v":0},{"$f":"Inmeetformulier!L60","v":0},{"$f":"Inmeetformulier!N60","v":0},{"$f":"Inmeetformulier!P60","v":0},{"$f":"Inmeetformulier!Q60","v":0},{"$f":"Inmeetformulier!S60","v":0},null,null,null,null,null,null,{"$f":"IF(Y60=\"\",\"\",(1/(1+Formulierdata!$A$29))*Y60)","v":""},null,{"$f":"IF($W$22=1,IF(R60=\"\",\"\",IF(OR(U60=\"\",U60=0,U60=1),R60,R60*U60)),IF(R60=\"\",\"\",IF(OR(U60=\"\",U60=0,U60=1),R60*(1+Formulierdata!$A$29),R60*(1+Formulierdata!$A$29)*U60)))","v":""}]
[null,{"$f":"Inmeetformulier!B61","v":0},{"$f":"Inmeetformulier!C61","v":0},{"$f":"Inmeetformulier!D61","v":0},{"$f":"Inmeetformulier!E61","v":0},{"$f":"Inmeetformulier!F61","v":0},{"$f":"Inmeetformulier!G61","v":0},{"$f":"Inmeetformulier!H61","v":0},{"$f":"Inmeetformulier!I61","v":0},{"$f":"Inmeetformulier!J61","v":0},{"$f":"Inmeetformulier!K61","v":0},{"$f":"Inmeetformulier!L61","v":0},{"$f":"Inmeetformulier!N61","v":0},{"$f":"Inmeetformulier!P61","v":0},{"$f":"Inmeetformulier!Q61","v":0},{"$f":"Inmeetformulier!S61","v":0},null,null,null,null,null,null,{"$f":"IF(Y61=\"\",\"\",(1/(1+Formulierdata!$A$29))*Y61)","v":""},null,{"$f":"IF($W$22=1,IF(R61=\"\",\"\",IF(OR(U61=\"\",U61=0,U61=1),R61,R61*U61)),IF(R61=\"\",\"\",IF(OR(U61=\"\",U61=0,U61=1),R61*(1+Formulierdata!$A$29),R61*(1+Formulierdata!$A$29)*U61)))","v":""}]
[null,{"$f":"Inmeetformulier!B62","v":0},{"$f":"Inmeetformulier!C62","v":0},{"$f":"Inmeetformulier!D62","v":0},{"$f":"Inmeetformulier!E62","v":0},{"$f":"Inmeetformulier!F62","v":0},{"$f":"Inmeetformulier!G62","v":0},{"$f":"Inmeetformulier!H62","v":0},{"$f":"Inmeetformulier!I62","v":0},{"$f":"Inmeetformulier!J62","v":0},{"$f":"Inmeetformulier!K62","v":0},{"$f":"Inmeetformulier!L62","v":0},{"$f":"Inmeetformulier!N62","v":0},{"$f":"Inmeetformulier!P62","v":0},{"$f":"Inmeetformulier!Q62","v":0},{"$f":"Inmeetformulier!S62","v":0},null,null,null,null,null,null,{"$f":"IF(Y62=\"\",\"\",(1/(1+Formulierdata!$A$29))*Y62)","v":""},null,{"$f":"IF($W$22=1,IF(R62=\"\",\"\",IF(OR(U62=\"\",U62=0,U62=1),R62,R62*U62)),IF(R62=\"\",\"\",IF(OR(U62=\"\",U62=0,U62=1),R62*(1+Formulierdata!$A$29),R62*(1+Formulierdata!$A$29)*U62)))","v":""}]
[null,{"$f":"Inmeetformulier!B63","v":0},{"$f":"Inmeetformulier!C63","v":0},{"$f":"Inmeetformulier!D63","v":0},{"$f":"Inmeetformulier!E63","v":0},{"$f":"Inmeetformulier!F63","v":0},{"$f":"Inmeetformulier!G63","v":0},{"$f":"Inmeetformulier!H63","v":0},{"$f":"Inmeetformulier!I63","v":0},{"$f":"Inmeetformulier!J63","v":0},{"$f":"Inmeetformulier!K63","v":0},{"$f":"Inmeetformulier!L63","v":0},{"$f":"Inmeetformulier!N63","v":0},{"$f":"Inmeetformulier!P63","v":0},{"$f":"Inmeetformulier!Q63","v":0},{"$f":"Inmeetformulier!S63","v":0},null,null,null,null,null,null,{"$f":"IF(Y63=\"\",\"\",(1/(1+Formulierdata!$A$29))*Y63)","v":""},null,{"$f":"IF($W$22=1,IF(R63=\"\",\"\",IF(OR(U63=\"\",U63=0,U63=1),R63,R63*U63)),IF(R63=\"\",\"\",IF(OR(U63=\"\",U63=0,U63=1),R63*(1+Formulierdata!$A$29),R63*(1+Formulierdata!$A$29)*U63)))","v":""}]
[null,{"$f":"Inmeetformulier!B64","v":0},{"$f":"Inmeetformulier!C64","v":0},{"$f":"Inmeetformulier!D64","v":0},{"$f":"Inmeetformulier!E64","v":0},{"$f":"Inmeetformulier!F64","v":0},{"$f":"Inmeetformulier!G64","v":0},{"$f":"Inmeetformulier!H64","v":0},{"$f":"Inmeetformulier!I64","v":0},{"$f":"Inmeetformulier!J64","v":0},{"$f":"Inmeetformulier!K64","v":0},{"$f":"Inmeetformulier!L64","v":0},{"$f":"Inmeetformulier!N64","v":0},{"$f":"Inmeetformulier!P64","v":0},{"$f":"Inmeetformulier!Q64","v":0},{"$f":"Inmeetformulier!S64","v":0},null,null,null,null,null,null,{"$f":"IF(Y64=\"\",\"\",(1/(1+Formulierdata!$A$29))*Y64)","v":""},null,{"$f":"IF($W$22=1,IF(R64=\"\",\"\",IF(OR(U64=\"\",U64=0,U64=1),R64,R64*U64)),IF(R64=\"\",\"\",IF(OR(U64=\"\",U64=0,U64=1),R64*(1+Formulierdata!$A$29),R64*(1+Formulierdata!$A$29)*U64)))","v":""}]
[null,{"$f":"Inmeetformulier!B65","v":0},{"$f":"Inmeetformulier!C65","v":0},{"$f":"Inmeetformulier!D65","v":0},{"$f":"Inmeetformulier!E65","v":0},{"$f":"Inmeetformulier!F65","v":0},{"$f":"Inmeetformulier!G65","v":0},{"$f":"Inmeetformulier!H65","v":0},{"$f":"Inmeetformulier!I65","v":0},{"$f":"Inmeetformulier!J65","v":0},{"$f":"Inmeetformulier!K65","v":0},{"$f":"Inmeetformulier!L65","v":0},{"$f":"Inmeetformulier!N65","v":0},{"$f":"Inmeetformulier!P65","v":0},{"$f":"Inmeetformulier!Q65","v":0},{"$f":"Inmeetformulier!S65","v":0},null,null,null,null,null,null,{"$f":"IF(Y65=\"\",\"\",(1/(1+Formulierdata!$A$29))*Y65)","v":""},null,{"$f":"IF($W$22=1,IF(R65=\"\",\"\",IF(OR(U65=\"\",U65=0,U65=1),R65,R65*U65)),IF(R65=\"\",\"\",IF(OR(U65=\"\",U65=0,U65=1),R65*(1+Formulierdata!$A$29),R65*(1+Formulierdata!$A$29)*U65)))","v":""}]
[null,{"$f":"Inmeetformulier!B66","v":0},{"$f":"Inmeetformulier!C66","v":0},{"$f":"Inmeetformulier!D66","v":0},{"$f":"Inmeetformulier!E66","v":0},{"$f":"Inmeetformulier!F66","v":0},{"$f":"Inmeetformulier!G66","v":0},{"$f":"Inmeetformulier!H66","v":0},{"$f":"Inmeetformulier!I66","v":0},{"$f":"Inmeetformulier!J66","v":0},{"$f":"Inmeetformulier!K66","v":0},{"$f":"Inmeetformulier!L66","v":0},{"$f":"Inmeetformulier!N66","v":0},{"$f":"Inmeetformulier!P66","v":0},{"$f":"Inmeetformulier!Q66","v":0},{"$f":"Inmeetformulier!S66","v":0},null,null,null,null,null,null,{"$f":"IF(Y66=\"\",\"\",(1/(1+Formulierdata!$A$29))*Y66)","v":""},null,{"$f":"IF($W$22=1,IF(R66=\"\",\"\",IF(OR(U66=\"\",U66=0,U66=1),R66,R66*U66)),IF(R66=\"\",\"\",IF(OR(U66=\"\",U66=0,U66=1),R66*(1+Formulierdata!$A$29),R66*(1+Formulierdata!$A$29)*U66)))","v":""}]
[null,{"$f":"Inmeetformulier!B67","v":0},{"$f":"Inmeetformulier!C67","v":0},{"$f":"Inmeetformulier!D67","v":0},{"$f":"Inmeetformulier!E67","v":0},{"$f":"Inmeetformulier!F67","v":0},{"$f":"Inmeetformulier!G67","v":0},{"$f":"Inmeetformulier!H67","v":0},{"$f":"Inmeetformulier!I67","v":0},{"$f":"Inmeetformulier!J67","v":0},{"$f":"Inmeetformulier!K67","v":0},{"$f":"Inmeetformulier!L67","v":0},{"$f":"Inmeetformulier!N67","v":0},{"$f":"Inmeetformulier!P67","v":0},{"$f":"Inmeetformulier!Q67","v":0},{"$f":"Inmeetformulier!S67","v":0},null,null,null,null,null,null,{"$f":"IF(Y67=\"\",\"\",(1/(1+Formulierdata!$A$29))*Y67)","v":""},null,{"$f":"IF($W$22=1,IF(R67=\"\",\"\",IF(OR(U67=\"\",U67=0,U67=1),R67,R67*U67)),IF(R67=\"\",\"\",IF(OR(U67=\"\",U67=0,U67=1),R67*(1+Formulierdata!$A$29),R67*(1+Formulierdata!$A$29)*U67)))","v":""}]
[null,{"$f":"Inmeetformulier!B68","v":0},{"$f":"Inmeetformulier!C68","v":0},{"$f":"Inmeetformulier!D68","v":0},{"$f":"Inmeetformulier!E68","v":0},{"$f":"Inmeetformulier!F68","v":0},{"$f":"Inmeetformulier!G68","v":0},{"$f":"Inmeetformulier!H68","v":0},{"$f":"Inmeetformulier!I68","v":0},{"$f":"Inmeetformulier!J68","v":0},{"$f":"Inmeetformulier!K68","v":0},{"$f":"Inmeetformulier!L68","v":0},{"$f":"Inmeetformulier!N68","v":0},{"$f":"Inmeetformulier!P68","v":0},{"$f":"Inmeetformulier!Q68","v":0},{"$f":"Inmeetformulier!S68","v":0},null,null,null,null,null,null,{"$f":"IF(Y68=\"\",\"\",(1/(1+Formulierdata!$A$29))*Y68)","v":""},null,{"$f":"IF($W$22=1,IF(R68=\"\",\"\",IF(OR(U68=\"\",U68=0,U68=1),R68,R68*U68)),IF(R68=\"\",\"\",IF(OR(U68=\"\",U68=0,U68=1),R68*(1+Formulierdata!$A$29),R68*(1+Formulierdata!$A$29)*U68)))","v":""}]
[null,{"$f":"Inmeetformulier!B69","v":0},{"$f":"Inmeetformulier!C69","v":0},{"$f":"Inmeetformulier!D69","v":0},{"$f":"Inmeetformulier!E69","v":0},{"$f":"Inmeetformulier!F69","v":0},{"$f":"Inmeetformulier!G69","v":0},{"$f":"Inmeetformulier!H69","v":0},{"$f":"Inmeetformulier!I69","v":0},{"$f":"Inmeetformulier!J69","v":0},{"$f":"Inmeetformulier!K69","v":0},{"$f":"Inmeetformulier!L69","v":0},{"$f":"Inmeetformulier!N69","v":0},{"$f":"Inmeetformulier!P69","v":0},{"$f":"Inmeetformulier!Q69","v":0},{"$f":"Inmeetformulier!S69","v":0},null,null,null,null,null,null,{"$f":"IF(Y69=\"\",\"\",(1/(1+Formulierdata!$A$29))*Y69)","v":""},null,{"$f":"IF($W$22=1,IF(R69=\"\",\"\",IF(OR(U69=\"\",U69=0,U69=1),R69,R69*U69)),IF(R69=\"\",\"\",IF(OR(U69=\"\",U69=0,U69=1),R69*(1+Formulierdata!$A$29),R69*(1+Formulierdata!$A$29)*U69)))","v":""}]
[null,{"$f":"Inmeetformulier!B70","v":0},{"$f":"Inmeetformulier!C70","v":0},{"$f":"Inmeetformulier!D70","v":0},{"$f":"Inmeetformulier!E70","v":0},{"$f":"Inmeetformulier!F70","v":0},{"$f":"Inmeetformulier!G70","v":0},{"$f":"Inmeetformulier!H70","v":0},{"$f":"Inmeetformulier!I70","v":0},{"$f":"Inmeetformulier!J70","v":0},{"$f":"Inmeetformulier!K70","v":0},{"$f":"Inmeetformulier!L70","v":0},{"$f":"Inmeetformulier!N70","v":0},{"$f":"Inmeetformulier!P70","v":0},{"$f":"Inmeetformulier!Q70","v":0},{"$f":"Inmeetformulier!S70","v":0},null,null,null,null,null,null,{"$f":"IF(Y70=\"\",\"\",(1/(1+Formulierdata!$A$29))*Y70)","v":""},null,{"$f":"IF($W$22=1,IF(R70=\"\",\"\",IF(OR(U70=\"\",U70=0,U70=1),R70,R70*U70)),IF(R70=\"\",\"\",IF(OR(U70=\"\",U70=0,U70=1),R70*(1+Formulierdata!$A$29),R70*(1+Formulierdata!$A$29)*U70)))","v":""}]
[null,{"$f":"Inmeetformulier!B71","v":0},{"$f":"Inmeetformulier!C71","v":0},{"$f":"Inmeetformulier!D71","v":0},{"$f":"Inmeetformulier!E71","v":0},{"$f":"Inmeetformulier!F71","v":0},{"$f":"Inmeetformulier!G71","v":0},{"$f":"Inmeetformulier!H71","v":0},{"$f":"Inmeetformulier!I71","v":0},{"$f":"Inmeetformulier!J71","v":0},{"$f":"Inmeetformulier!K71","v":0},{"$f":"Inmeetformulier!L71","v":0},{"$f":"Inmeetformulier!N71","v":0},{"$f":"Inmeetformulier!P71","v":0},{"$f":"Inmeetformulier!Q71","v":0},{"$f":"Inmeetformulier!S71","v":0},null,null,null,null,null,null,{"$f":"IF(Y71=\"\",\"\",(1/(1+Formulierdata!$A$29))*Y71)","v":""},null,{"$f":"IF($W$22=1,IF(R71=\"\",\"\",IF(OR(U71=\"\",U71=0,U71=1),R71,R71*U71)),IF(R71=\"\",\"\",IF(OR(U71=\"\",U71=0,U71=1),R71*(1+Formulierdata!$A$29),R71*(1+Formulierdata!$A$29)*U71)))","v":""}]
[null,{"$f":"Inmeetformulier!B72","v":0},{"$f":"Inmeetformulier!C72","v":0},{"$f":"Inmeetformulier!D72","v":0},{"$f":"Inmeetformulier!E72","v":0},{"$f":"Inmeetformulier!F72","v":0},{"$f":"Inmeetformulier!G72","v":0},{"$f":"Inmeetformulier!H72","v":0},{"$f":"Inmeetformulier!I72","v":0},{"$f":"Inmeetformulier!J72","v":0},{"$f":"Inmeetformulier!K72","v":0},{"$f":"Inmeetformulier!L72","v":0},{"$f":"Inmeetformulier!N72","v":0},{"$f":"Inmeetformulier!P72","v":0},{"$f":"Inmeetformulier!Q72","v":0},{"$f":"Inmeetformulier!S72","v":0},null,null,null,null,null,null,{"$f":"IF(Y72=\"\",\"\",(1/(1+Formulierdata!$A$29))*Y72)","v":""},null,{"$f":"IF($W$22=1,IF(R72=\"\",\"\",IF(OR(U72=\"\",U72=0,U72=1),R72,R72*U72)),IF(R72=\"\",\"\",IF(OR(U72=\"\",U72=0,U72=1),R72*(1+Formulierdata!$A$29),R72*(1+Formulierdata!$A$29)*U72)))","v":""}]
[null,{"$f":"Inmeetformulier!B73","v":0},{"$f":"Inmeetformulier!C73","v":0},{"$f":"Inmeetformulier!D73","v":0},{"$f":"Inmeetformulier!E73","v":0},{"$f":"Inmeetformulier!F73","v":0},{"$f":"Inmeetformulier!G73","v":0},{"$f":"Inmeetformulier!H73","v":0},{"$f":"Inmeetformulier!I73","v":0},{"$f":"Inmeetformulier!J73","v":0},{"$f":"Inmeetformulier!K73","v":0},{"$f":"Inmeetformulier!L73","v":0},{"$f":"Inmeetformulier!N73","v":0},{"$f":"Inmeetformulier!P73","v":0},{"$f":"Inmeetformulier!Q73","v":0},{"$f":"Inmeetformulier!S73","v":0},null,null,null,null,null,null,{"$f":"IF(Y73=\"\",\"\",(1/(1+Formulierdata!$A$29))*Y73)","v":""},null,{"$f":"IF($W$22=1,IF(R73=\"\",\"\",IF(OR(U73=\"\",U73=0,U73=1),R73,R73*U73)),IF(R73=\"\",\"\",IF(OR(U73=\"\",U73=0,U73=1),R73*(1+Formulierdata!$A$29),R73*(1+Formulierdata!$A$29)*U73)))","v":""}]
[null,{"$f":"Inmeetformulier!B74","v":0},{"$f":"Inmeetformulier!C74","v":0},{"$f":"Inmeetformulier!D74","v":0},{"$f":"Inmeetformulier!E74","v":0},{"$f":"Inmeetformulier!F74","v":0},{"$f":"Inmeetformulier!G74","v":0},{"$f":"Inmeetformulier!H74","v":0},{"$f":"Inmeetformulier!I74","v":0},{"$f":"Inmeetformulier!J74","v":0},{"$f":"Inmeetformulier!K74","v":0},{"$f":"Inmeetformulier!L74","v":0},{"$f":"Inmeetformulier!N74","v":0},{"$f":"Inmeetformulier!P74","v":0},{"$f":"Inmeetformulier!Q74","v":0},{"$f":"Inmeetformulier!S74","v":0},null,null,null,null,null,null,{"$f":"IF(Y74=\"\",\"\",(1/(1+Formulierdata!$A$29))*Y74)","v":""},null,{"$f":"IF($W$22=1,IF(R74=\"\",\"\",IF(OR(U74=\"\",U74=0,U74=1),R74,R74*U74)),IF(R74=\"\",\"\",IF(OR(U74=\"\",U74=0,U74=1),R74*(1+Formulierdata!$A$29),R74*(1+Formulierdata!$A$29)*U74)))","v":""}]
[null,{"$f":"Inmeetformulier!B75","v":0},{"$f":"Inmeetformulier!C75","v":0},{"$f":"Inmeetformulier!D75","v":0},{"$f":"Inmeetformulier!E75","v":0},{"$f":"Inmeetformulier!F75","v":0},{"$f":"Inmeetformulier!G75","v":0},{"$f":"Inmeetformulier!H75","v":0},{"$f":"Inmeetformulier!I75","v":0},{"$f":"Inmeetformulier!J75","v":0},{"$f":"Inmeetformulier!K75","v":0},{"$f":"Inmeetformulier!L75","v":0},{"$f":"Inmeetformulier!N75","v":0},{"$f":"Inmeetformulier!P75","v":0},{"$f":"Inmeetformulier!Q75","v":0},{"$f":"Inmeetformulier!S75","v":0},null,null,null,null,null,null,{"$f":"IF(Y75=\"\",\"\",(1/(1+Formulierdata!$A$29))*Y75)","v":""},null,{"$f":"IF($W$22=1,IF(R75=\"\",\"\",IF(OR(U75=\"\",U75=0,U75=1),R75,R75*U75)),IF(R75=\"\",\"\",IF(OR(U75=\"\",U75=0,U75=1),R75*(1+Formulierdata!$A$29),R75*(1+Formulierdata!$A$29)*U75)))","v":""}]
[null,{"$f":"Inmeetformulier!B76","v":0},{"$f":"Inmeetformulier!C76","v":0},{"$f":"Inmeetformulier!D76","v":0},{"$f":"Inmeetformulier!E76","v":0},{"$f":"Inmeetformulier!F76","v":0},{"$f":"Inmeetformulier!G76","v":0},{"$f":"Inmeetformulier!H76","v":0},{"$f":"Inmeetformulier!I76","v":0},{"$f":"Inmeetformulier!J76","v":0},{"$f":"Inmeetformulier!K76","v":0},{"$f":"Inmeetformulier!L76","v":0},{"$f":"Inmeetformulier!N76","v":0},{"$f":"Inmeetformulier!P76","v":0},{"$f":"Inmeetformulier!Q76","v":0},{"$f":"Inmeetformulier!S76","v":0},null,null,null,null,null,null,{"$f":"IF(Y76=\"\",\"\",(1/(1+Formulierdata!$A$29))*Y76)","v":""},null,{"$f":"IF($W$22=1,IF(R76=\"\",\"\",IF(OR(U76=\"\",U76=0,U76=1),R76,R76*U76)),IF(R76=\"\",\"\",IF(OR(U76=\"\",U76=0,U76=1),R76*(1+Formulierdata!$A$29),R76*(1+Formulierdata!$A$29)*U76)))","v":""}]
[null,{"$f":"Inmeetformulier!B77","v":0},{"$f":"Inmeetformulier!C77","v":0},{"$f":"Inmeetformulier!D77","v":0},{"$f":"Inmeetformulier!E77","v":0},{"$f":"Inmeetformulier!F77","v":0},{"$f":"Inmeetformulier!G77","v":0},{"$f":"Inmeetformulier!H77","v":0},{"$f":"Inmeetformulier!I77","v":0},{"$f":"Inmeetformulier!J77","v":0},{"$f":"Inmeetformulier!K77","v":0},{"$f":"Inmeetformulier!L77","v":0},{"$f":"Inmeetformulier!N77","v":0},{"$f":"Inmeetformulier!P77","v":0},{"$f":"Inmeetformulier!Q77","v":0},{"$f":"Inmeetformulier!S77","v":0},null,null,null,null,null,null,{"$f":"IF(Y77=\"\",\"\",(1/(1+Formulierdata!$A$29))*Y77)","v":""},null,{"$f":"IF($W$22=1,IF(R77=\"\",\"\",IF(OR(U77=\"\",U77=0,U77=1),R77,R77*U77)),IF(R77=\"\",\"\",IF(OR(U77=\"\",U77=0,U77=1),R77*(1+Formulierdata!$A$29),R77*(1+Formulierdata!$A$29)*U77)))","v":""}]
[null,{"$f":"Inmeetformulier!B78","v":0},{"$f":"Inmeetformulier!C78","v":0},{"$f":"Inmeetformulier!D78","v":0},{"$f":"Inmeetformulier!E78","v":0},{"$f":"Inmeetformulier!F78","v":0},{"$f":"Inmeetformulier!G78","v":0},{"$f":"Inmeetformulier!H78","v":0},{"$f":"Inmeetformulier!I78","v":0},{"$f":"Inmeetformulier!J78","v":0},{"$f":"Inmeetformulier!K78","v":0},{"$f":"Inmeetformulier!L78","v":0},{"$f":"Inmeetformulier!N78","v":0},{"$f":"Inmeetformulier!P78","v":0},{"$f":"Inmeetformulier!Q78","v":0},{"$f":"Inmeetformulier!S78","v":0},null,null,null,null,null,null,{"$f":"IF(Y78=\"\",\"\",(1/(1+Formulierdata!$A$29))*Y78)","v":""},null,{"$f":"IF($W$22=1,IF(R78=\"\",\"\",IF(OR(U78=\"\",U78=0,U78=1),R78,R78*U78)),IF(R78=\"\",\"\",IF(OR(U78=\"\",U78=0,U78=1),R78*(1+Formulierdata!$A$29),R78*(1+Formulierdata!$A$29)*U78)))","v":""}]
[null,{"$f":"Inmeetformulier!B79","v":0},{"$f":"Inmeetformulier!C79","v":0},{"$f":"Inmeetformulier!D79","v":0},{"$f":"Inmeetformulier!E79","v":0},{"$f":"Inmeetformulier!F79","v":0},{"$f":"Inmeetformulier!G79","v":0},{"$f":"Inmeetformulier!H79","v":0},{"$f":"Inmeetformulier!I79","v":0},{"$f":"Inmeetformulier!J79","v":0},{"$f":"Inmeetformulier!K79","v":0},{"$f":"Inmeetformulier!L79","v":0},{"$f":"Inmeetformulier!N79","v":0},{"$f":"Inmeetformulier!P79","v":0},{"$f":"Inmeetformulier!Q79","v":0},{"$f":"Inmeetformulier!S79","v":0},null,null,null,null,null,null,{"$f":"IF(Y79=\"\",\"\",(1/(1+Formulierdata!$A$29))*Y79)","v":""},null,{"$f":"IF($W$22=1,IF(R79=\"\",\"\",IF(OR(U79=\"\",U79=0,U79=1),R79,R79*U79)),IF(R79=\"\",\"\",IF(OR(U79=\"\",U79=0,U79=1),R79*(1+Formulierdata!$A$29),R79*(1+Formulierdata!$A$29)*U79)))","v":""}]
[null,{"$f":"Inmeetformulier!B80","v":0},{"$f":"Inmeetformulier!C80","v":0},{"$f":"Inmeetformulier!D80","v":0},{"$f":"Inmeetformulier!E80","v":0},{"$f":"Inmeetformulier!F80","v":0},{"$f":"Inmeetformulier!G80","v":0},{"$f":"Inmeetformulier!H80","v":0},{"$f":"Inmeetformulier!I80","v":0},{"$f":"Inmeetformulier!J80","v":0},{"$f":"Inmeetformulier!K80","v":0},{"$f":"Inmeetformulier!L80","v":0},{"$f":"Inmeetformulier!N80","v":0},{"$f":"Inmeetformulier!P80","v":0},{"$f":"Inmeetformulier!Q80","v":0},{"$f":"Inmeetformulier!S80","v":0},null,null,null,null,null,null,{"$f":"IF(Y80=\"\",\"\",(1/(1+Formulierdata!$A$29))*Y80)","v":""},null,{"$f":"IF($W$22=1,IF(R80=\"\",\"\",IF(OR(U80=\"\",U80=0,U80=1),R80,R80*U80)),IF(R80=\"\",\"\",IF(OR(U80=\"\",U80=0,U80=1),R80*(1+Formulierdata!$A$29),R80*(1+Formulierdata!$A$29)*U80)))","v":""}]
[null,{"$f":"Inmeetformulier!B81","v":0},{"$f":"Inmeetformulier!C81","v":0},{"$f":"Inmeetformulier!D81","v":0},{"$f":"Inmeetformulier!E81","v":0},{"$f":"Inmeetformulier!F81","v":0},{"$f":"Inmeetformulier!G81","v":0},{"$f":"Inmeetformulier!H81","v":0},{"$f":"Inmeetformulier!I81","v":0},{"$f":"Inmeetformulier!J81","v":0},{"$f":"Inmeetformulier!K81","v":0},{"$f":"Inmeetformulier!L81","v":0},{"$f":"Inmeetformulier!N81","v":0},{"$f":"Inmeetformulier!P81","v":0},{"$f":"Inmeetformulier!Q81","v":0},{"$f":"Inmeetformulier!S81","v":0},null,null,null,null,null,null,{"$f":"IF(Y81=\"\",\"\",(1/(1+Formulierdata!$A$29))*Y81)","v":""},null,{"$f":"IF($W$22=1,IF(R81=\"\",\"\",IF(OR(U81=\"\",U81=0,U81=1),R81,R81*U81)),IF(R81=\"\",\"\",IF(OR(U81=\"\",U81=0,U81=1),R81*(1+Formulierdata!$A$29),R81*(1+Formulierdata!$A$29)*U81)))","v":""}]
[null,{"$f":"Inmeetformulier!B82","v":0},{"$f":"Inmeetformulier!C82","v":0},{"$f":"Inmeetformulier!D82","v":0},{"$f":"Inmeetformulier!E82","v":0},{"$f":"Inmeetformulier!F82","v":0},{"$f":"Inmeetformulier!G82","v":0},{"$f":"Inmeetformulier!H82","v":0},{"$f":"Inmeetformulier!I82","v":0},{"$f":"Inmeetformulier!J82","v":0},{"$f":"Inmeetformulier!K82","v":0},{"$f":"Inmeetformulier!L82","v":0},{"$f":"Inmeetformulier!N82","v":0},{"$f":"Inmeetformulier!P82","v":0},{"$f":"Inmeetformulier!Q82","v":0},{"$f":"Inmeetformulier!S82","v":0},null,null,null,null,null,null,{"$f":"IF(Y82=\"\",\"\",(1/(1+Formulierdata!$A$29))*Y82)","v":""},null,{"$f":"IF($W$22=1,IF(R82=\"\",\"\",IF(OR(U82=\"\",U82=0,U82=1),R82,R82*U82)),IF(R82=\"\",\"\",IF(OR(U82=\"\",U82=0,U82=1),R82*(1+Formulierdata!$A$29),R82*(1+Formulierdata!$A$29)*U82)))","v":""}]
[null,{"$f":"Inmeetformulier!B83","v":0},{"$f":"Inmeetformulier!C83","v":0},{"$f":"Inmeetformulier!D83","v":0},{"$f":"Inmeetformulier!E83","v":0},{"$f":"Inmeetformulier!F83","v":0},{"$f":"Inmeetformulier!G83","v":0},{"$f":"Inmeetformulier!H83","v":0},{"$f":"Inmeetformulier!I83","v":0},{"$f":"Inmeetformulier!J83","v":0},{"$f":"Inmeetformulier!K83","v":0},{"$f":"Inmeetformulier!L83","v":0},{"$f":"Inmeetformulier!N83","v":0},{"$f":"Inmeetformulier!P83","v":0},{"$f":"Inmeetformulier!Q83","v":0},{"$f":"Inmeetformulier!S83","v":0},null,null,null,null,null,null,{"$f":"IF(Y83=\"\",\"\",(1/(1+Formulierdata!$A$29))*Y83)","v":""},null,{"$f":"IF($W$22=1,IF(R83=\"\",\"\",IF(OR(U83=\"\",U83=0,U83=1),R83,R83*U83)),IF(R83=\"\",\"\",IF(OR(U83=\"\",U83=0,U83=1),R83*(1+Formulierdata!$A$29),R83*(1+Formulierdata!$A$29)*U83)))","v":""}]
[null,{"$f":"Inmeetformulier!B84","v":0},{"$f":"Inmeetformulier!C84","v":0},{"$f":"Inmeetformulier!D84","v":0},{"$f":"Inmeetformulier!E84","v":0},{"$f":"Inmeetformulier!F84","v":0},{"$f":"Inmeetformulier!G84","v":0},{"$f":"Inmeetformulier!H84","v":0},{"$f":"Inmeetformulier!I84","v":0},{"$f":"Inmeetformulier!J84","v":0},{"$f":"Inmeetformulier!K84","v":0},{"$f":"Inmeetformulier!L84","v":0},{"$f":"Inmeetformulier!N84","v":0},{"$f":"Inmeetformulier!P84","v":0},{"$f":"Inmeetformulier!Q84","v":0},{"$f":"Inmeetformulier!S84","v":0},null,null,null,null,null,null,{"$f":"IF(Y84=\"\",\"\",(1/(1+Formulierdata!$A$29))*Y84)","v":""},null,{"$f":"IF($W$22=1,IF(R84=\"\",\"\",IF(OR(U84=\"\",U84=0,U84=1),R84,R84*U84)),IF(R84=\"\",\"\",IF(OR(U84=\"\",U84=0,U84=1),R84*(1+Formulierdata!$A$29),R84*(1+Formulierdata!$A$29)*U84)))","v":""}]
[null,{"$f":"Inmeetformulier!B85","v":0},{"$f":"Inmeetformulier!C85","v":0},{"$f":"Inmeetformulier!D85","v":0},{"$f":"Inmeetformulier!E85","v":0},{"$f":"Inmeetformulier!F85","v":0},{"$f":"Inmeetformulier!G85","v":0},{"$f":"Inmeetformulier!H85","v":0},{"$f":"Inmeetformulier!I85","v":0},{"$f":"Inmeetformulier!J85","v":0},{"$f":"Inmeetformulier!K85","v":0},{"$f":"Inmeetformulier!L85","v":0},{"$f":"Inmeetformulier!N85","v":0},{"$f":"Inmeetformulier!P85","v":0},{"$f":"Inmeetformulier!Q85","v":0},{"$f":"Inmeetformulier!S85","v":0},null,null,null,null,null,null,{"$f":"IF(Y85=\"\",\"\",(1/(1+Formulierdata!$A$29))*Y85)","v":""},null,{"$f":"IF($W$22=1,IF(R85=\"\",\"\",IF(OR(U85=\"\",U85=0,U85=1),R85,R85*U85)),IF(R85=\"\",\"\",IF(OR(U85=\"\",U85=0,U85=1),R85*(1+Formulierdata!$A$29),R85*(1+Formulierdata!$A$29)*U85)))","v":""}]
[null,{"$f":"Inmeetformulier!B86","v":0},{"$f":"Inmeetformulier!C86","v":0},{"$f":"Inmeetformulier!D86","v":0},{"$f":"Inmeetformulier!E86","v":0},{"$f":"Inmeetformulier!F86","v":0},{"$f":"Inmeetformulier!G86","v":0},{"$f":"Inmeetformulier!H86","v":0},{"$f":"Inmeetformulier!I86","v":0},{"$f":"Inmeetformulier!J86","v":0},{"$f":"Inmeetformulier!K86","v":0},{"$f":"Inmeetformulier!L86","v":0},{"$f":"Inmeetformulier!N86","v":0},{"$f":"Inmeetformulier!P86","v":0},{"$f":"Inmeetformulier!Q86","v":0},{"$f":"Inmeetformulier!S86","v":0},null,null,null,null,null,null,{"$f":"IF(Y86=\"\",\"\",(1/(1+Formulierdata!$A$29))*Y86)","v":""},null,{"$f":"IF($W$22=1,IF(R86=\"\",\"\",IF(OR(U86=\"\",U86=0,U86=1),R86,R86*U86)),IF(R86=\"\",\"\",IF(OR(U86=\"\",U86=0,U86=1),R86*(1+Formulierdata!$A$29),R86*(1+Formulierdata!$A$29)*U86)))","v":""}]
[null,{"$f":"Inmeetformulier!B87","v":0},{"$f":"Inmeetformulier!C87","v":0},{"$f":"Inmeetformulier!D87","v":0},{"$f":"Inmeetformulier!E87","v":0},{"$f":"Inmeetformulier!F87","v":0},{"$f":"Inmeetformulier!G87","v":0},{"$f":"Inmeetformulier!H87","v":0},{"$f":"Inmeetformulier!I87","v":0},{"$f":"Inmeetformulier!J87","v":0},{"$f":"Inmeetformulier!K87","v":0},{"$f":"Inmeetformulier!L87","v":0},{"$f":"Inmeetformulier!N87","v":0},{"$f":"Inmeetformulier!P87","v":0},{"$f":"Inmeetformulier!Q87","v":0},{"$f":"Inmeetformulier!S87","v":0},null,null,null,null,null,null,{"$f":"IF(Y87=\"\",\"\",(1/(1+Formulierdata!$A$29))*Y87)","v":""},null,{"$f":"IF($W$22=1,IF(R87=\"\",\"\",IF(OR(U87=\"\",U87=0,U87=1),R87,R87*U87)),IF(R87=\"\",\"\",IF(OR(U87=\"\",U87=0,U87=1),R87*(1+Formulierdata!$A$29),R87*(1+Formulierdata!$A$29)*U87)))","v":""}]
[null,{"$f":"Inmeetformulier!B88","v":0},{"$f":"Inmeetformulier!C88","v":0},{"$f":"Inmeetformulier!D88","v":0},{"$f":"Inmeetformulier!E88","v":0},{"$f":"Inmeetformulier!F88","v":0},{"$f":"Inmeetformulier!G88","v":0},{"$f":"Inmeetformulier!H88","v":0},{"$f":"Inmeetformulier!I88","v":0},{"$f":"Inmeetformulier!J88","v":0},{"$f":"Inmeetformulier!K88","v":0},{"$f":"Inmeetformulier!L88","v":0},{"$f":"Inmeetformulier!N88","v":0},{"$f":"Inmeetformulier!P88","v":0},{"$f":"Inmeetformulier!Q88","v":0},{"$f":"Inmeetformulier!S88","v":0},null,null,null,null,null,null,{"$f":"IF(Y88=\"\",\"\",(1/(1+Formulierdata!$A$29))*Y88)","v":""},null,{"$f":"IF($W$22=1,IF(R88=\"\",\"\",IF(OR(U88=\"\",U88=0,U88=1),R88,R88*U88)),IF(R88=\"\",\"\",IF(OR(U88=\"\",U88=0,U88=1),R88*(1+Formulierdata!$A$29),R88*(1+Formulierdata!$A$29)*U88)))","v":""}]
[null,{"$f":"Inmeetformulier!B89","v":0},{"$f":"Inmeetformulier!C89","v":0},{"$f":"Inmeetformulier!D89","v":0},{"$f":"Inmeetformulier!E89","v":0},{"$f":"Inmeetformulier!F89","v":0},{"$f":"Inmeetformulier!G89","v":0},{"$f":"Inmeetformulier!H89","v":0},{"$f":"Inmeetformulier!I89","v":0},{"$f":"Inmeetformulier!J89","v":0},{"$f":"Inmeetformulier!K89","v":0},{"$f":"Inmeetformulier!L89","v":0},{"$f":"Inmeetformulier!N89","v":0},{"$f":"Inmeetformulier!P89","v":0},{"$f":"Inmeetformulier!Q89","v":0},{"$f":"Inmeetformulier!S89","v":0},null,null,null,null,null,null,{"$f":"IF(Y89=\"\",\"\",(1/(1+Formulierdata!$A$29))*Y89)","v":""},null,{"$f":"IF($W$22=1,IF(R89=\"\",\"\",IF(OR(U89=\"\",U89=0,U89=1),R89,R89*U89)),IF(R89=\"\",\"\",IF(OR(U89=\"\",U89=0,U89=1),R89*(1+Formulierdata!$A$29),R89*(1+Formulierdata!$A$29)*U89)))","v":""}]
[null,{"$f":"Inmeetformulier!B90","v":0},{"$f":"Inmeetformulier!C90","v":0},{"$f":"Inmeetformulier!D90","v":0},{"$f":"Inmeetformulier!E90","v":0},{"$f":"Inmeetformulier!F90","v":0},{"$f":"Inmeetformulier!G90","v":0},{"$f":"Inmeetformulier!H90","v":0},{"$f":"Inmeetformulier!I90","v":0},{"$f":"Inmeetformulier!J90","v":0},{"$f":"Inmeetformulier!K90","v":0},{"$f":"Inmeetformulier!L90","v":0},{"$f":"Inmeetformulier!N90","v":0},{"$f":"Inmeetformulier!P90","v":0},{"$f":"Inmeetformulier!Q90","v":0},{"$f":"Inmeetformulier!S90","v":0},null,null,null,null,null,null,{"$f":"IF(Y90=\"\",\"\",(1/(1+Formulierdata!$A$29))*Y90)","v":""},null,{"$f":"IF($W$22=1,IF(R90=\"\",\"\",IF(OR(U90=\"\",U90=0,U90=1),R90,R90*U90)),IF(R90=\"\",\"\",IF(OR(U90=\"\",U90=0,U90=1),R90*(1+Formulierdata!$A$29),R90*(1+Formulierdata!$A$29)*U90)))","v":""}]
[null,{"$f":"Inmeetformulier!B91","v":0},{"$f":"Inmeetformulier!C91","v":0},{"$f":"Inmeetformulier!D91","v":0},{"$f":"Inmeetformulier!E91","v":0},{"$f":"Inmeetformulier!F91","v":0},{"$f":"Inmeetformulier!G91","v":0},{"$f":"Inmeetformulier!H91","v":0},{"$f":"Inmeetformulier!I91","v":0},{"$f":"Inmeetformulier!J91","v":0},{"$f":"Inmeetformulier!K91","v":0},{"$f":"Inmeetformulier!L91","v":0},{"$f":"Inmeetformulier!N91","v":0},{"$f":"Inmeetformulier!P91","v":0},{"$f":"Inmeetformulier!Q91","v":0},{"$f":"Inmeetformulier!S91","v":0},null,null,null,null,null,null,{"$f":"IF(Y91=\"\",\"\",(1/(1+Formulierdata!$A$29))*Y91)","v":""},null,{"$f":"IF($W$22=1,IF(R91=\"\",\"\",IF(OR(U91=\"\",U91=0,U91=1),R91,R91*U91)),IF(R91=\"\",\"\",IF(OR(U91=\"\",U91=0,U91=1),R91*(1+Formulierdata!$A$29),R91*(1+Formulierdata!$A$29)*U91)))","v":""}]
[null,{"$f":"Inmeetformulier!B92","v":0},{"$f":"Inmeetformulier!C92","v":0},{"$f":"Inmeetformulier!D92","v":0},{"$f":"Inmeetformulier!E92","v":0},{"$f":"Inmeetformulier!F92","v":0},{"$f":"Inmeetformulier!G92","v":0},{"$f":"Inmeetformulier!H92","v":0},{"$f":"Inmeetformulier!I92","v":0},{"$f":"Inmeetformulier!J92","v":0},{"$f":"Inmeetformulier!K92","v":0},{"$f":"Inmeetformulier!L92","v":0},{"$f":"Inmeetformulier!N92","v":0},{"$f":"Inmeetformulier!P92","v":0},{"$f":"Inmeetformulier!Q92","v":0},{"$f":"Inmeetformulier!S92","v":0},null,null,null,null,null,null,{"$f":"IF(Y92=\"\",\"\",(1/(1+Formulierdata!$A$29))*Y92)","v":""},null,{"$f":"IF($W$22=1,IF(R92=\"\",\"\",IF(OR(U92=\"\",U92=0,U92=1),R92,R92*U92)),IF(R92=\"\",\"\",IF(OR(U92=\"\",U92=0,U92=1),R92*(1+Formulierdata!$A$29),R92*(1+Formulierdata!$A$29)*U92)))","v":""}]
[null,{"$f":"Inmeetformulier!B93","v":0},{"$f":"Inmeetformulier!C93","v":0},{"$f":"Inmeetformulier!D93","v":0},{"$f":"Inmeetformulier!E93","v":0},{"$f":"Inmeetformulier!F93","v":0},{"$f":"Inmeetformulier!G93","v":0},{"$f":"Inmeetformulier!H93","v":0},{"$f":"Inmeetformulier!I93","v":0},{"$f":"Inmeetformulier!J93","v":0},{"$f":"Inmeetformulier!K93","v":0},{"$f":"Inmeetformulier!L93","v":0},{"$f":"Inmeetformulier!N93","v":0},{"$f":"Inmeetformulier!P93","v":0},{"$f":"Inmeetformulier!Q93","v":0},{"$f":"Inmeetformulier!S93","v":0},null,null,null,null,null,null,{"$f":"IF(Y93=\"\",\"\",(1/(1+Formulierdata!$A$29))*Y93)","v":""},null,{"$f":"IF($W$22=1,IF(R93=\"\",\"\",IF(OR(U93=\"\",U93=0,U93=1),R93,R93*U93)),IF(R93=\"\",\"\",IF(OR(U93=\"\",U93=0,U93=1),R93*(1+Formulierdata!$A$29),R93*(1+Formulierdata!$A$29)*U93)))","v":""}]
[null,{"$f":"Inmeetformulier!B94","v":0},{"$f":"Inmeetformulier!C94","v":0},{"$f":"Inmeetformulier!D94","v":0},{"$f":"Inmeetformulier!E94","v":0},{"$f":"Inmeetformulier!F94","v":0},{"$f":"Inmeetformulier!G94","v":0},{"$f":"Inmeetformulier!H94","v":0},{"$f":"Inmeetformulier!I94","v":0},{"$f":"Inmeetformulier!J94","v":0},{"$f":"Inmeetformulier!K94","v":0},{"$f":"Inmeetformulier!L94","v":0},{"$f":"Inmeetformulier!N94","v":0},{"$f":"Inmeetformulier!P94","v":0},{"$f":"Inmeetformulier!Q94","v":0},{"$f":"Inmeetformulier!S94","v":0},null,null,null,null,null,null,{"$f":"IF(Y94=\"\",\"\",(1/(1+Formulierdata!$A$29))*Y94)","v":""},null,{"$f":"IF($W$22=1,IF(R94=\"\",\"\",IF(OR(U94=\"\",U94=0,U94=1),R94,R94*U94)),IF(R94=\"\",\"\",IF(OR(U94=\"\",U94=0,U94=1),R94*(1+Formulierdata!$A$29),R94*(1+Formulierdata!$A$29)*U94)))","v":""}]
[null,{"$f":"Inmeetformulier!B95","v":0},{"$f":"Inmeetformulier!C95","v":0},{"$f":"Inmeetformulier!D95","v":0},{"$f":"Inmeetformulier!E95","v":0},{"$f":"Inmeetformulier!F95","v":0},{"$f":"Inmeetformulier!G95","v":0},{"$f":"Inmeetformulier!H95","v":0},{"$f":"Inmeetformulier!I95","v":0},{"$f":"Inmeetformulier!J95","v":0},{"$f":"Inmeetformulier!K95","v":0},{"$f":"Inmeetformulier!L95","v":0},{"$f":"Inmeetformulier!N95","v":0},{"$f":"Inmeetformulier!P95","v":0},{"$f":"Inmeetformulier!Q95","v":0},{"$f":"Inmeetformulier!S95","v":0},null,null,null,null,null,null,{"$f":"IF(Y95=\"\",\"\",(1/(1+Formulierdata!$A$29))*Y95)","v":""},null,{"$f":"IF($W$22=1,IF(R95=\"\",\"\",IF(OR(U95=\"\",U95=0,U95=1),R95,R95*U95)),IF(R95=\"\",\"\",IF(OR(U95=\"\",U95=0,U95=1),R95*(1+Formulierdata!$A$29),R95*(1+Formulierdata!$A$29)*U95)))","v":""}]
[null,{"$f":"Inmeetformulier!B96","v":0},{"$f":"Inmeetformulier!C96","v":0},{"$f":"Inmeetformulier!D96","v":0},{"$f":"Inmeetformulier!E96","v":0},{"$f":"Inmeetformulier!F96","v":0},{"$f":"Inmeetformulier!G96","v":0},{"$f":"Inmeetformulier!H96","v":0},{"$f":"Inmeetformulier!I96","v":0},{"$f":"Inmeetformulier!J96","v":0},{"$f":"Inmeetformulier!K96","v":0},{"$f":"Inmeetformulier!L96","v":0},{"$f":"Inmeetformulier!N96","v":0},{"$f":"Inmeetformulier!P96","v":0},{"$f":"Inmeetformulier!Q96","v":0},{"$f":"Inmeetformulier!S96","v":0},null,null,null,null,null,null,{"$f":"IF(Y96=\"\",\"\",(1/(1+Formulierdata!$A$29))*Y96)","v":""},null,{"$f":"IF($W$22=1,IF(R96=\"\",\"\",IF(OR(U96=\"\",U96=0,U96=1),R96,R96*U96)),IF(R96=\"\",\"\",IF(OR(U96=\"\",U96=0,U96=1),R96*(1+Formulierdata!$A$29),R96*(1+Formulierdata!$A$29)*U96)))","v":""}]
[null,{"$f":"Inmeetformulier!B97","v":0},{"$f":"Inmeetformulier!C97","v":0},{"$f":"Inmeetformulier!D97","v":0},{"$f":"Inmeetformulier!E97","v":0},{"$f":"Inmeetformulier!F97","v":0},{"$f":"Inmeetformulier!G97","v":0},{"$f":"Inmeetformulier!H97","v":0},{"$f":"Inmeetformulier!I97","v":0},{"$f":"Inmeetformulier!J97","v":0},{"$f":"Inmeetformulier!K97","v":0},{"$f":"Inmeetformulier!L97","v":0},{"$f":"Inmeetformulier!N97","v":0},{"$f":"Inmeetformulier!P97","v":0},{"$f":"Inmeetformulier!Q97","v":0},{"$f":"Inmeetformulier!S97","v":0},null,null,null,null,null,null,{"$f":"IF(Y97=\"\",\"\",(1/(1+Formulierdata!$A$29))*Y97)","v":""},null,{"$f":"IF($W$22=1,IF(R97=\"\",\"\",IF(OR(U97=\"\",U97=0,U97=1),R97,R97*U97)),IF(R97=\"\",\"\",IF(OR(U97=\"\",U97=0,U97=1),R97*(1+Formulierdata!$A$29),R97*(1+Formulierdata!$A$29)*U97)))","v":""}]
[null,{"$f":"Inmeetformulier!B98","v":0},{"$f":"Inmeetformulier!C98","v":0},{"$f":"Inmeetformulier!D98","v":0},{"$f":"Inmeetformulier!E98","v":0},{"$f":"Inmeetformulier!F98","v":0},{"$f":"Inmeetformulier!G98","v":0},{"$f":"Inmeetformulier!H98","v":0},{"$f":"Inmeetformulier!I98","v":0},{"$f":"Inmeetformulier!J98","v":0},{"$f":"Inmeetformulier!K98","v":0},{"$f":"Inmeetformulier!L98","v":0},{"$f":"Inmeetformulier!N98","v":0},{"$f":"Inmeetformulier!P98","v":0},{"$f":"Inmeetformulier!Q98","v":0},{"$f":"Inmeetformulier!S98","v":0},null,null,null,null,null,null,{"$f":"IF(Y98=\"\",\"\",(1/(1+Formulierdata!$A$29))*Y98)","v":""},null,{"$f":"IF($W$22=1,IF(R98=\"\",\"\",IF(OR(U98=\"\",U98=0,U98=1),R98,R98*U98)),IF(R98=\"\",\"\",IF(OR(U98=\"\",U98=0,U98=1),R98*(1+Formulierdata!$A$29),R98*(1+Formulierdata!$A$29)*U98)))","v":""}]
[null,{"$f":"Inmeetformulier!B99","v":0},{"$f":"Inmeetformulier!C99","v":0},{"$f":"Inmeetformulier!D99","v":0},{"$f":"Inmeetformulier!E99","v":0},{"$f":"Inmeetformulier!F99","v":0},{"$f":"Inmeetformulier!G99","v":0},{"$f":"Inmeetformulier!H99","v":0},{"$f":"Inmeetformulier!I99","v":0},{"$f":"Inmeetformulier!J99","v":0},{"$f":"Inmeetformulier!K99","v":0},{"$f":"Inmeetformulier!L99","v":0},{"$f":"Inmeetformulier!N99","v":0},{"$f":"Inmeetformulier!P99","v":0},{"$f":"Inmeetformulier!Q99","v":0},{"$f":"Inmeetformulier!S99","v":0},null,null,null,null,null,null,{"$f":"IF(Y99=\"\",\"\",(1/(1+Formulierdata!$A$29))*Y99)","v":""},null,{"$f":"IF($W$22=1,IF(R99=\"\",\"\",IF(OR(U99=\"\",U99=0,U99=1),R99,R99*U99)),IF(R99=\"\",\"\",IF(OR(U99=\"\",U99=0,U99=1),R99*(1+Formulierdata!$A$29),R99*(1+Formulierdata!$A$29)*U99)))","v":""}]
[null,{"$f":"Inmeetformulier!B100","v":0},{"$f":"Inmeetformulier!C100","v":0},{"$f":"Inmeetformulier!D100","v":0},{"$f":"Inmeetformulier!E100","v":0},{"$f":"Inmeetformulier!F100","v":0},{"$f":"Inmeetformulier!G100","v":0},{"$f":"Inmeetformulier!H100","v":0},{"$f":"Inmeetformulier!I100","v":0},{"$f":"Inmeetformulier!J100","v":0},{"$f":"Inmeetformulier!K100","v":0},{"$f":"Inmeetformulier!L100","v":0},{"$f":"Inmeetformulier!N100","v":0},{"$f":"Inmeetformulier!P100","v":0},{"$f":"Inmeetformulier!Q100","v":0},{"$f":"Inmeetformulier!S100","v":0},null,null,null,null,null,null,{"$f":"IF(Y100=\"\",\"\",(1/(1+Formulierdata!$A$29))*Y100)","v":""},null,{"$f":"IF($W$22=1,IF(R100=\"\",\"\",IF(OR(U100=\"\",U100=0,U100=1),R100,R100*U100)),IF(R100=\"\",\"\",IF(OR(U100=\"\",U100=0,U100=1),R100*(1+Formulierdata!$A$29),R100*(1+Formulierdata!$A$29)*U100)))","v":""}]
[null,{"$f":"Inmeetformulier!B101","v":0},{"$f":"Inmeetformulier!C101","v":0},{"$f":"Inmeetformulier!D101","v":0},{"$f":"Inmeetformulier!E101","v":0},{"$f":"Inmeetformulier!F101","v":0},{"$f":"Inmeetformulier!G101","v":0},{"$f":"Inmeetformulier!H101","v":0},{"$f":"Inmeetformulier!I101","v":0},{"$f":"Inmeetformulier!J101","v":0},{"$f":"Inmeetformulier!K101","v":0},{"$f":"Inmeetformulier!L101","v":0},{"$f":"Inmeetformulier!N101","v":0},{"$f":"Inmeetformulier!P101","v":0},{"$f":"Inmeetformulier!Q101","v":0},{"$f":"Inmeetformulier!S101","v":0},null,null,null,null,null,null,{"$f":"IF(Y101=\"\",\"\",(1/(1+Formulierdata!$A$29))*Y101)","v":""},null,{"$f":"IF($W$22=1,IF(R101=\"\",\"\",IF(OR(U101=\"\",U101=0,U101=1),R101,R101*U101)),IF(R101=\"\",\"\",IF(OR(U101=\"\",U101=0,U101=1),R101*(1+Formulierdata!$A$29),R101*(1+Formulierdata!$A$29)*U101)))","v":""}]
[null,{"$f":"Inmeetformulier!B102","v":0},{"$f":"Inmeetformulier!C102","v":0},{"$f":"Inmeetformulier!D102","v":0},{"$f":"Inmeetformulier!E102","v":0},{"$f":"Inmeetformulier!F102","v":0},{"$f":"Inmeetformulier!G102","v":0},{"$f":"Inmeetformulier!H102","v":0},{"$f":"Inmeetformulier!I102","v":0},{"$f":"Inmeetformulier!J102","v":0},{"$f":"Inmeetformulier!K102","v":0},{"$f":"Inmeetformulier!L102","v":0},{"$f":"Inmeetformulier!N102","v":0},{"$f":"Inmeetformulier!P102","v":0},{"$f":"Inmeetformulier!Q102","v":0},{"$f":"Inmeetformulier!S102","v":0},null,null,null,null,null,null,{"$f":"IF(Y102=\"\",\"\",(1/(1+Formulierdata!$A$29))*Y102)","v":""},null,{"$f":"IF($W$22=1,IF(R102=\"\",\"\",IF(OR(U102=\"\",U102=0,U102=1),R102,R102*U102)),IF(R102=\"\",\"\",IF(OR(U102=\"\",U102=0,U102=1),R102*(1+Formulierdata!$A$29),R102*(1+Formulierdata!$A$29)*U102)))","v":""}]
[null,{"$f":"Inmeetformulier!B103","v":0},{"$f":"Inmeetformulier!C103","v":0},{"$f":"Inmeetformulier!D103","v":0},{"$f":"Inmeetformulier!E103","v":0},{"$f":"Inmeetformulier!F103","v":0},{"$f":"Inmeetformulier!G103","v":0},{"$f":"Inmeetformulier!H103","v":0},{"$f":"Inmeetformulier!I103","v":0},{"$f":"Inmeetformulier!J103","v":0},{"$f":"Inmeetformulier!K103","v":0},{"$f":"Inmeetformulier!L103","v":0},{"$f":"Inmeetformulier!N103","v":0},{"$f":"Inmeetformulier!P103","v":0},{"$f":"Inmeetformulier!Q103","v":0},{"$f":"Inmeetformulier!S103","v":0},null,null,null,null,null,null,{"$f":"IF(Y103=\"\",\"\",(1/(1+Formulierdata!$A$29))*Y103)","v":""},null,{"$f":"IF($W$22=1,IF(R103=\"\",\"\",IF(OR(U103=\"\",U103=0,U103=1),R103,R103*U103)),IF(R103=\"\",\"\",IF(OR(U103=\"\",U103=0,U103=1),R103*(1+Formulierdata!$A$29),R103*(1+Formulierdata!$A$29)*U103)))","v":""}]
[null,{"$f":"Inmeetformulier!B104","v":0},{"$f":"Inmeetformulier!C104","v":0},{"$f":"Inmeetformulier!D104","v":0},{"$f":"Inmeetformulier!E104","v":0},{"$f":"Inmeetformulier!F104","v":0},{"$f":"Inmeetformulier!G104","v":0},{"$f":"Inmeetformulier!H104","v":0},{"$f":"Inmeetformulier!I104","v":0},{"$f":"Inmeetformulier!J104","v":0},{"$f":"Inmeetformulier!K104","v":0},{"$f":"Inmeetformulier!L104","v":0},{"$f":"Inmeetformulier!N104","v":0},{"$f":"Inmeetformulier!P104","v":0},{"$f":"Inmeetformulier!Q104","v":0},{"$f":"Inmeetformulier!S104","v":0},null,null,null,null,null,null,{"$f":"IF(Y104=\"\",\"\",(1/(1+Formulierdata!$A$29))*Y104)","v":""},null,{"$f":"IF($W$22=1,IF(R104=\"\",\"\",IF(OR(U104=\"\",U104=0,U104=1),R104,R104*U104)),IF(R104=\"\",\"\",IF(OR(U104=\"\",U104=0,U104=1),R104*(1+Formulierdata!$A$29),R104*(1+Formulierdata!$A$29)*U104)))","v":""}]
[null,{"$f":"Inmeetformulier!B105","v":0},{"$f":"Inmeetformulier!C105","v":0},{"$f":"Inmeetformulier!D105","v":0},{"$f":"Inmeetformulier!E105","v":0},{"$f":"Inmeetformulier!F105","v":0},{"$f":"Inmeetformulier!G105","v":0},{"$f":"Inmeetformulier!H105","v":0},{"$f":"Inmeetformulier!I105","v":0},{"$f":"Inmeetformulier!J105","v":0},{"$f":"Inmeetformulier!K105","v":0},{"$f":"Inmeetformulier!L105","v":0},{"$f":"Inmeetformulier!N105","v":0},{"$f":"Inmeetformulier!P105","v":0},{"$f":"Inmeetformulier!Q105","v":0},{"$f":"Inmeetformulier!S105","v":0},null,null,null,null,null,null,{"$f":"IF(Y105=\"\",\"\",(1/(1+Formulierdata!$A$29))*Y105)","v":""},null,{"$f":"IF($W$22=1,IF(R105=\"\",\"\",IF(OR(U105=\"\",U105=0,U105=1),R105,R105*U105)),IF(R105=\"\",\"\",IF(OR(U105=\"\",U105=0,U105=1),R105*(1+Formulierdata!$A$29),R105*(1+Formulierdata!$A$29)*U105)))","v":""}]
[null,{"$f":"Inmeetformulier!B106","v":0},{"$f":"Inmeetformulier!C106","v":0},{"$f":"Inmeetformulier!D106","v":0},{"$f":"Inmeetformulier!E106","v":0},{"$f":"Inmeetformulier!F106","v":0},{"$f":"Inmeetformulier!G106","v":0},{"$f":"Inmeetformulier!H106","v":0},{"$f":"Inmeetformulier!I106","v":0},{"$f":"Inmeetformulier!J106","v":0},{"$f":"Inmeetformulier!K106","v":0},{"$f":"Inmeetformulier!L106","v":0},{"$f":"Inmeetformulier!N106","v":0},{"$f":"Inmeetformulier!P106","v":0},{"$f":"Inmeetformulier!Q106","v":0},{"$f":"Inmeetformulier!S106","v":0},null,null,null,null,null,null,{"$f":"IF(Y106=\"\",\"\",(1/(1+Formulierdata!$A$29))*Y106)","v":""},null,{"$f":"IF($W$22=1,IF(R106=\"\",\"\",IF(OR(U106=\"\",U106=0,U106=1),R106,R106*U106)),IF(R106=\"\",\"\",IF(OR(U106=\"\",U106=0,U106=1),R106*(1+Formulierdata!$A$29),R106*(1+Formulierdata!$A$29)*U106)))","v":""}]
[null,{"$f":"Inmeetformulier!B107","v":0},{"$f":"Inmeetformulier!C107","v":0},{"$f":"Inmeetformulier!D107","v":0},{"$f":"Inmeetformulier!E107","v":0},{"$f":"Inmeetformulier!F107","v":0},{"$f":"Inmeetformulier!G107","v":0},{"$f":"Inmeetformulier!H107","v":0},{"$f":"Inmeetformulier!I107","v":0},{"$f":"Inmeetformulier!J107","v":0},{"$f":"Inmeetformulier!K107","v":0},{"$f":"Inmeetformulier!L107","v":0},{"$f":"Inmeetformulier!N107","v":0},{"$f":"Inmeetformulier!P107","v":0},{"$f":"Inmeetformulier!Q107","v":0},{"$f":"Inmeetformulier!S107","v":0},null,null,null,null,null,null,{"$f":"IF(Y107=\"\",\"\",(1/(1+Formulierdata!$A$29))*Y107)","v":""},null,{"$f":"IF($W$22=1,IF(R107=\"\",\"\",IF(OR(U107=\"\",U107=0,U107=1),R107,R107*U107)),IF(R107=\"\",\"\",IF(OR(U107=\"\",U107=0,U107=1),R107*(1+Formulierdata!$A$29),R107*(1+Formulierdata!$A$29)*U107)))","v":""}]
[null,{"$f":"Inmeetformulier!B108","v":0},{"$f":"Inmeetformulier!C108","v":0},{"$f":"Inmeetformulier!D108","v":0},{"$f":"Inmeetformulier!E108","v":0},{"$f":"Inmeetformulier!F108","v":0},{"$f":"Inmeetformulier!G108","v":0},{"$f":"Inmeetformulier!H108","v":0},{"$f":"Inmeetformulier!I108","v":0},{"$f":"Inmeetformulier!J108","v":0},{"$f":"Inmeetformulier!K108","v":0},{"$f":"Inmeetformulier!L108","v":0},{"$f":"Inmeetformulier!N108","v":0},{"$f":"Inmeetformulier!P108","v":0},{"$f":"Inmeetformulier!Q108","v":0},{"$f":"Inmeetformulier!S108","v":0},null,null,null,null,null,null,{"$f":"IF(Y108=\"\",\"\",(1/(1+Formulierdata!$A$29))*Y108)","v":""},null,{"$f":"IF($W$22=1,IF(R108=\"\",\"\",IF(OR(U108=\"\",U108=0,U108=1),R108,R108*U108)),IF(R108=\"\",\"\",IF(OR(U108=\"\",U108=0,U108=1),R108*(1+Formulierdata!$A$29),R108*(1+Formulierdata!$A$29)*U108)))","v":""}]
[null,{"$f":"Inmeetformulier!B109","v":0},{"$f":"Inmeetformulier!C109","v":0},{"$f":"Inmeetformulier!D109","v":0},{"$f":"Inmeetformulier!E109","v":0},{"$f":"Inmeetformulier!F109","v":0},{"$f":"Inmeetformulier!G109","v":0},{"$f":"Inmeetformulier!H109","v":0},{"$f":"Inmeetformulier!I109","v":0},{"$f":"Inmeetformulier!J109","v":0},{"$f":"Inmeetformulier!K109","v":0},{"$f":"Inmeetformulier!L109","v":0},{"$f":"Inmeetformulier!N109","v":0},{"$f":"Inmeetformulier!P109","v":0},{"$f":"Inmeetformulier!Q109","v":0},{"$f":"Inmeetformulier!S109","v":0},null,null,null,null,null,null,{"$f":"IF(Y109=\"\",\"\",(1/(1+Formulierdata!$A$29))*Y109)","v":""},null,{"$f":"IF($W$22=1,IF(R109=\"\",\"\",IF(OR(U109=\"\",U109=0,U109=1),R109,R109*U109)),IF(R109=\"\",\"\",IF(OR(U109=\"\",U109=0,U109=1),R109*(1+Formulierdata!$A$29),R109*(1+Formulierdata!$A$29)*U109)))","v":""}]
[null,{"$f":"Inmeetformulier!B110","v":0},{"$f":"Inmeetformulier!C110","v":0},{"$f":"Inmeetformulier!D110","v":0},{"$f":"Inmeetformulier!E110","v":0},{"$f":"Inmeetformulier!F110","v":0},{"$f":"Inmeetformulier!G110","v":0},{"$f":"Inmeetformulier!H110","v":0},{"$f":"Inmeetformulier!I110","v":0},{"$f":"Inmeetformulier!J110","v":0},{"$f":"Inmeetformulier!K110","v":0},{"$f":"Inmeetformulier!L110","v":0},{"$f":"Inmeetformulier!N110","v":0},{"$f":"Inmeetformulier!P110","v":0},{"$f":"Inmeetformulier!Q110","v":0},{"$f":"Inmeetformulier!S110","v":0},null,null,null,null,null,null,{"$f":"IF(Y110=\"\",\"\",(1/(1+Formulierdata!$A$29))*Y110)","v":""},null,{"$f":"IF($W$22=1,IF(R110=\"\",\"\",IF(OR(U110=\"\",U110=0,U110=1),R110,R110*U110)),IF(R110=\"\",\"\",IF(OR(U110=\"\",U110=0,U110=1),R110*(1+Formulierdata!$A$29),R110*(1+Formulierdata!$A$29)*U110)))","v":""}]
[null,{"$f":"Inmeetformulier!B111","v":0},{"$f":"Inmeetformulier!C111","v":0},{"$f":"Inmeetformulier!D111","v":0},{"$f":"Inmeetformulier!E111","v":0},{"$f":"Inmeetformulier!F111","v":0},{"$f":"Inmeetformulier!G111","v":0},{"$f":"Inmeetformulier!H111","v":0},{"$f":"Inmeetformulier!I111","v":0},{"$f":"Inmeetformulier!J111","v":0},{"$f":"Inmeetformulier!K111","v":0},{"$f":"Inmeetformulier!L111","v":0},{"$f":"Inmeetformulier!N111","v":0},{"$f":"Inmeetformulier!P111","v":0},{"$f":"Inmeetformulier!Q111","v":0},{"$f":"Inmeetformulier!S111","v":0},null,null,null,null,null,null,{"$f":"IF(Y111=\"\",\"\",(1/(1+Formulierdata!$A$29))*Y111)","v":""},null,{"$f":"IF($W$22=1,IF(R111=\"\",\"\",IF(OR(U111=\"\",U111=0,U111=1),R111,R111*U111)),IF(R111=\"\",\"\",IF(OR(U111=\"\",U111=0,U111=1),R111*(1+Formulierdata!$A$29),R111*(1+Formulierdata!$A$29)*U111)))","v":""}]
[null,{"$f":"Inmeetformulier!B112","v":0},{"$f":"Inmeetformulier!C112","v":0},{"$f":"Inmeetformulier!D112","v":0},{"$f":"Inmeetformulier!E112","v":0},{"$f":"Inmeetformulier!F112","v":0},{"$f":"Inmeetformulier!G112","v":0},{"$f":"Inmeetformulier!H112","v":0},{"$f":"Inmeetformulier!I112","v":0},{"$f":"Inmeetformulier!J112","v":0},{"$f":"Inmeetformulier!K112","v":0},{"$f":"Inmeetformulier!L112","v":0},{"$f":"Inmeetformulier!N112","v":0},{"$f":"Inmeetformulier!P112","v":0},{"$f":"Inmeetformulier!Q112","v":0},{"$f":"Inmeetformulier!S112","v":0},null,null,null,null,null,null,{"$f":"IF(Y112=\"\",\"\",(1/(1+Formulierdata!$A$29))*Y112)","v":""},null,{"$f":"IF($W$22=1,IF(R112=\"\",\"\",IF(OR(U112=\"\",U112=0,U112=1),R112,R112*U112)),IF(R112=\"\",\"\",IF(OR(U112=\"\",U112=0,U112=1),R112*(1+Formulierdata!$A$29),R112*(1+Formulierdata!$A$29)*U112)))","v":""}]
[null,{"$f":"Inmeetformulier!B113","v":0},{"$f":"Inmeetformulier!C113","v":0},{"$f":"Inmeetformulier!D113","v":0},{"$f":"Inmeetformulier!E113","v":0},{"$f":"Inmeetformulier!F113","v":0},{"$f":"Inmeetformulier!G113","v":0},{"$f":"Inmeetformulier!H113","v":0},{"$f":"Inmeetformulier!I113","v":0},{"$f":"Inmeetformulier!J113","v":0},{"$f":"Inmeetformulier!K113","v":0},{"$f":"Inmeetformulier!L113","v":0},{"$f":"Inmeetformulier!N113","v":0},{"$f":"Inmeetformulier!P113","v":0},{"$f":"Inmeetformulier!Q113","v":0},{"$f":"Inmeetformulier!S113","v":0},null,null,null,null,null,null,{"$f":"IF(Y113=\"\",\"\",(1/(1+Formulierdata!$A$29))*Y113)","v":""},null,{"$f":"IF($W$22=1,IF(R113=\"\",\"\",IF(OR(U113=\"\",U113=0,U113=1),R113,R113*U113)),IF(R113=\"\",\"\",IF(OR(U113=\"\",U113=0,U113=1),R113*(1+Formulierdata!$A$29),R113*(1+Formulierdata!$A$29)*U113)))","v":""}]
[null,{"$f":"Inmeetformulier!B114","v":0},{"$f":"Inmeetformulier!C114","v":0},{"$f":"Inmeetformulier!D114","v":0},{"$f":"Inmeetformulier!E114","v":0},{"$f":"Inmeetformulier!F114","v":0},{"$f":"Inmeetformulier!G114","v":0},{"$f":"Inmeetformulier!H114","v":0},{"$f":"Inmeetformulier!I114","v":0},{"$f":"Inmeetformulier!J114","v":0},{"$f":"Inmeetformulier!K114","v":0},{"$f":"Inmeetformulier!L114","v":0},{"$f":"Inmeetformulier!N114","v":0},{"$f":"Inmeetformulier!P114","v":0},{"$f":"Inmeetformulier!Q114","v":0},{"$f":"Inmeetformulier!S114","v":0},null,null,null,null,null,null,{"$f":"IF(Y114=\"\",\"\",(1/(1+Formulierdata!$A$29))*Y114)","v":""},null,{"$f":"IF($W$22=1,IF(R114=\"\",\"\",IF(OR(U114=\"\",U114=0,U114=1),R114,R114*U114)),IF(R114=\"\",\"\",IF(OR(U114=\"\",U114=0,U114=1),R114*(1+Formulierdata!$A$29),R114*(1+Formulierdata!$A$29)*U114)))","v":""}]
[null,{"$f":"Inmeetformulier!B115","v":0},{"$f":"Inmeetformulier!C115","v":0},{"$f":"Inmeetformulier!D115","v":0},{"$f":"Inmeetformulier!E115","v":0},{"$f":"Inmeetformulier!F115","v":0},{"$f":"Inmeetformulier!G115","v":0},{"$f":"Inmeetformulier!H115","v":0},{"$f":"Inmeetformulier!I115","v":0},{"$f":"Inmeetformulier!J115","v":0},{"$f":"Inmeetformulier!K115","v":0},{"$f":"Inmeetformulier!L115","v":0},{"$f":"Inmeetformulier!N115","v":0},{"$f":"Inmeetformulier!P115","v":0},{"$f":"Inmeetformulier!Q115","v":0},{"$f":"Inmeetformulier!S115","v":0},null,null,null,null,null,null,{"$f":"IF(Y115=\"\",\"\",(1/(1+Formulierdata!$A$29))*Y115)","v":""},null,{"$f":"IF($W$22=1,IF(R115=\"\",\"\",IF(OR(U115=\"\",U115=0,U115=1),R115,R115*U115)),IF(R115=\"\",\"\",IF(OR(U115=\"\",U115=0,U115=1),R115*(1+Formulierdata!$A$29),R115*(1+Formulierdata!$A$29)*U115)))","v":""}]
[null,{"$f":"Inmeetformulier!B116","v":0},{"$f":"Inmeetformulier!C116","v":0},{"$f":"Inmeetformulier!D116","v":0},{"$f":"Inmeetformulier!E116","v":0},{"$f":"Inmeetformulier!F116","v":0},{"$f":"Inmeetformulier!G116","v":0},{"$f":"Inmeetformulier!H116","v":0},{"$f":"Inmeetformulier!I116","v":0},{"$f":"Inmeetformulier!J116","v":0},{"$f":"Inmeetformulier!K116","v":0},{"$f":"Inmeetformulier!L116","v":0},{"$f":"Inmeetformulier!N116","v":0},{"$f":"Inmeetformulier!P116","v":0},{"$f":"Inmeetformulier!Q116","v":0},{"$f":"Inmeetformulier!S116","v":0},null,null,null,null,null,null,{"$f":"IF(Y116=\"\",\"\",(1/(1+Formulierdata!$A$29))*Y116)","v":""},null,{"$f":"IF($W$22=1,IF(R116=\"\",\"\",IF(OR(U116=\"\",U116=0,U116=1),R116,R116*U116)),IF(R116=\"\",\"\",IF(OR(U116=\"\",U116=0,U116=1),R116*(1+Formulierdata!$A$29),R116*(1+Formulierdata!$A$29)*U116)))","v":""}]
[null,{"$f":"Inmeetformulier!B117","v":0},{"$f":"Inmeetformulier!C117","v":0},{"$f":"Inmeetformulier!D117","v":0},{"$f":"Inmeetformulier!E117","v":0},{"$f":"Inmeetformulier!F117","v":0},{"$f":"Inmeetformulier!G117","v":0},{"$f":"Inmeetformulier!H117","v":0},{"$f":"Inmeetformulier!I117","v":0},{"$f":"Inmeetformulier!J117","v":0},{"$f":"Inmeetformulier!K117","v":0},{"$f":"Inmeetformulier!L117","v":0},{"$f":"Inmeetformulier!N117","v":0},{"$f":"Inmeetformulier!P117","v":0},{"$f":"Inmeetformulier!Q117","v":0},{"$f":"Inmeetformulier!S117","v":0},null,null,null,null,null,null,{"$f":"IF(Y117=\"\",\"\",(1/(1+Formulierdata!$A$29))*Y117)","v":""},null,{"$f":"IF($W$22=1,IF(R117=\"\",\"\",IF(OR(U117=\"\",U117=0,U117=1),R117,R117*U117)),IF(R117=\"\",\"\",IF(OR(U117=\"\",U117=0,U117=1),R117*(1+Formulierdata!$A$29),R117*(1+Formulierdata!$A$29)*U117)))","v":""}]
[null,{"$f":"Inmeetformulier!B118","v":0},{"$f":"Inmeetformulier!C118","v":0},{"$f":"Inmeetformulier!D118","v":0},{"$f":"Inmeetformulier!E118","v":0},{"$f":"Inmeetformulier!F118","v":0},{"$f":"Inmeetformulier!G118","v":0},{"$f":"Inmeetformulier!H118","v":0},{"$f":"Inmeetformulier!I118","v":0},{"$f":"Inmeetformulier!J118","v":0},{"$f":"Inmeetformulier!K118","v":0},{"$f":"Inmeetformulier!L118","v":0},{"$f":"Inmeetformulier!N118","v":0},{"$f":"Inmeetformulier!P118","v":0},{"$f":"Inmeetformulier!Q118","v":0},{"$f":"Inmeetformulier!S118","v":0},null,null,null,null,null,null,{"$f":"IF(Y118=\"\",\"\",(1/(1+Formulierdata!$A$29))*Y118)","v":""},null,{"$f":"IF($W$22=1,IF(R118=\"\",\"\",IF(OR(U118=\"\",U118=0,U118=1),R118,R118*U118)),IF(R118=\"\",\"\",IF(OR(U118=\"\",U118=0,U118=1),R118*(1+Formulierdata!$A$29),R118*(1+Formulierdata!$A$29)*U118)))","v":""}]
[null,{"$f":"Inmeetformulier!B119","v":0},{"$f":"Inmeetformulier!C119","v":0},{"$f":"Inmeetformulier!D119","v":0},{"$f":"Inmeetformulier!E119","v":0},{"$f":"Inmeetformulier!F119","v":0},{"$f":"Inmeetformulier!G119","v":0},{"$f":"Inmeetformulier!H119","v":0},{"$f":"Inmeetformulier!I119","v":0},{"$f":"Inmeetformulier!J119","v":0},{"$f":"Inmeetformulier!K119","v":0},{"$f":"Inmeetformulier!L119","v":0},{"$f":"Inmeetformulier!N119","v":0},{"$f":"Inmeetformulier!P119","v":0},{"$f":"Inmeetformulier!Q119","v":0},{"$f":"Inmeetformulier!S119","v":0},null,null,null,null,null,null,{"$f":"IF(Y119=\"\",\"\",(1/(1+Formulierdata!$A$29))*Y119)","v":""},null,{"$f":"IF($W$22=1,IF(R119=\"\",\"\",IF(OR(U119=\"\",U119=0,U119=1),R119,R119*U119)),IF(R119=\"\",\"\",IF(OR(U119=\"\",U119=0,U119=1),R119*(1+Formulierdata!$A$29),R119*(1+Formulierdata!$A$29)*U119)))","v":""}]
[null,{"$f":"Inmeetformulier!B120","v":0},{"$f":"Inmeetformulier!C120","v":0},{"$f":"Inmeetformulier!D120","v":0},{"$f":"Inmeetformulier!E120","v":0},{"$f":"Inmeetformulier!F120","v":0},{"$f":"Inmeetformulier!G120","v":0},{"$f":"Inmeetformulier!H120","v":0},{"$f":"Inmeetformulier!I120","v":0},{"$f":"Inmeetformulier!J120","v":0},{"$f":"Inmeetformulier!K120","v":0},{"$f":"Inmeetformulier!L120","v":0},{"$f":"Inmeetformulier!N120","v":0},{"$f":"Inmeetformulier!P120","v":0},{"$f":"Inmeetformulier!Q120","v":0},{"$f":"Inmeetformulier!S120","v":0},null,null,null,null,null,null,{"$f":"IF(Y120=\"\",\"\",(1/(1+Formulierdata!$A$29))*Y120)","v":""},null,{"$f":"IF($W$22=1,IF(R120=\"\",\"\",IF(OR(U120=\"\",U120=0,U120=1),R120,R120*U120)),IF(R120=\"\",\"\",IF(OR(U120=\"\",U120=0,U120=1),R120*(1+Formulierdata!$A$29),R120*(1+Formulierdata!$A$29)*U120)))","v":""}]
[null,{"$f":"Inmeetformulier!B121","v":0},{"$f":"Inmeetformulier!C121","v":0},{"$f":"Inmeetformulier!D121","v":0},{"$f":"Inmeetformulier!E121","v":0},{"$f":"Inmeetformulier!F121","v":0},{"$f":"Inmeetformulier!G121","v":0},{"$f":"Inmeetformulier!H121","v":0},{"$f":"Inmeetformulier!I121","v":0},{"$f":"Inmeetformulier!J121","v":0},{"$f":"Inmeetformulier!K121","v":0},{"$f":"Inmeetformulier!L121","v":0},{"$f":"Inmeetformulier!N121","v":0},{"$f":"Inmeetformulier!P121","v":0},{"$f":"Inmeetformulier!Q121","v":0},{"$f":"Inmeetformulier!S121","v":0},null,null,null,null,null,null,{"$f":"IF(Y121=\"\",\"\",(1/(1+Formulierdata!$A$29))*Y121)","v":""},null,{"$f":"IF($W$22=1,IF(R121=\"\",\"\",IF(OR(U121=\"\",U121=0,U121=1),R121,R121*U121)),IF(R121=\"\",\"\",IF(OR(U121=\"\",U121=0,U121=1),R121*(1+Formulierdata!$A$29),R121*(1+Formulierdata!$A$29)*U121)))","v":""}]
[null,{"$f":"Inmeetformulier!B122","v":0},{"$f":"Inmeetformulier!C122","v":0},{"$f":"Inmeetformulier!D122","v":0},{"$f":"Inmeetformulier!E122","v":0},{"$f":"Inmeetformulier!F122","v":0},{"$f":"Inmeetformulier!G122","v":0},{"$f":"Inmeetformulier!H122","v":0},{"$f":"Inmeetformulier!I122","v":0},{"$f":"Inmeetformulier!J122","v":0},{"$f":"Inmeetformulier!K122","v":0},{"$f":"Inmeetformulier!L122","v":0},{"$f":"Inmeetformulier!N122","v":0},{"$f":"Inmeetformulier!P122","v":0},{"$f":"Inmeetformulier!Q122","v":0},{"$f":"Inmeetformulier!S122","v":0},null,null,null,null,null,null,{"$f":"IF(Y122=\"\",\"\",(1/(1+Formulierdata!$A$29))*Y122)","v":""},null,{"$f":"IF($W$22=1,IF(R122=\"\",\"\",IF(OR(U122=\"\",U122=0,U122=1),R122,R122*U122)),IF(R122=\"\",\"\",IF(OR(U122=\"\",U122=0,U122=1),R122*(1+Formulierdata!$A$29),R122*(1+Formulierdata!$A$29)*U122)))","v":""}]
[null,{"$f":"Inmeetformulier!B123","v":0},{"$f":"Inmeetformulier!C123","v":0},{"$f":"Inmeetformulier!D123","v":0},{"$f":"Inmeetformulier!E123","v":0},{"$f":"Inmeetformulier!F123","v":0},{"$f":"Inmeetformulier!G123","v":0},{"$f":"Inmeetformulier!H123","v":0},{"$f":"Inmeetformulier!I123","v":0},{"$f":"Inmeetformulier!J123","v":0},{"$f":"Inmeetformulier!K123","v":0},{"$f":"Inmeetformulier!L123","v":0},{"$f":"Inmeetformulier!N123","v":0},{"$f":"Inmeetformulier!P123","v":0},{"$f":"Inmeetformulier!Q123","v":0},{"$f":"Inmeetformulier!S123","v":0},null,null,null,null,null,null,{"$f":"IF(Y123=\"\",\"\",(1/(1+Formulierdata!$A$29))*Y123)","v":""},null,{"$f":"IF($W$22=1,IF(R123=\"\",\"\",IF(OR(U123=\"\",U123=0,U123=1),R123,R123*U123)),IF(R123=\"\",\"\",IF(OR(U123=\"\",U123=0,U123=1),R123*(1+Formulierdata!$A$29),R123*(1+Formulierdata!$A$29)*U123)))","v":""}]
[null,{"$f":"Inmeetformulier!B124","v":0},{"$f":"Inmeetformulier!C124","v":0},{"$f":"Inmeetformulier!D124","v":0},{"$f":"Inmeetformulier!E124","v":0},{"$f":"Inmeetformulier!F124","v":0},{"$f":"Inmeetformulier!G124","v":0},{"$f":"Inmeetformulier!H124","v":0},{"$f":"Inmeetformulier!I124","v":0},{"$f":"Inmeetformulier!J124","v":0},{"$f":"Inmeetformulier!K124","v":0},{"$f":"Inmeetformulier!L124","v":0},{"$f":"Inmeetformulier!N124","v":0},{"$f":"Inmeetformulier!P124","v":0},{"$f":"Inmeetformulier!Q124","v":0},{"$f":"Inmeetformulier!S124","v":0},null,null,null,null,null,null,{"$f":"IF(Y124=\"\",\"\",(1/(1+Formulierdata!$A$29))*Y124)","v":""},null,{"$f":"IF($W$22=1,IF(R124=\"\",\"\",IF(OR(U124=\"\",U124=0,U124=1),R124,R124*U124)),IF(R124=\"\",\"\",IF(OR(U124=\"\",U124=0,U124=1),R124*(1+Formulierdata!$A$29),R124*(1+Formulierdata!$A$29)*U124)))","v":""}]
[null,{"$f":"Inmeetformulier!B125","v":0},{"$f":"Inmeetformulier!C125","v":0},{"$f":"Inmeetformulier!D125","v":0},{"$f":"Inmeetformulier!E125","v":0},{"$f":"Inmeetformulier!F125","v":0},{"$f":"Inmeetformulier!G125","v":0},{"$f":"Inmeetformulier!H125","v":0},{"$f":"Inmeetformulier!I125","v":0},{"$f":"Inmeetformulier!J125","v":0},{"$f":"Inmeetformulier!K125","v":0},{"$f":"Inmeetformulier!L125","v":0},{"$f":"Inmeetformulier!N125","v":0},{"$f":"Inmeetformulier!P125","v":0},{"$f":"Inmeetformulier!Q125","v":0},{"$f":"Inmeetformulier!S125","v":0},null,null,null,null,null,null,{"$f":"IF(Y125=\"\",\"\",(1/(1+Formulierdata!$A$29))*Y125)","v":""},null,{"$f":"IF($W$22=1,IF(R125=\"\",\"\",IF(OR(U125=\"\",U125=0,U125=1),R125,R125*U125)),IF(R125=\"\",\"\",IF(OR(U125=\"\",U125=0,U125=1),R125*(1+Formulierdata!$A$29),R125*(1+Formulierdata!$A$29)*U125)))","v":""}]

{"sheet":"Offerte montage","index":5,"n_rows":125,"n_cols":19,"rows_kept":125,"cut":false,"hidden":true,"merged":[[124,2,124,7],[23,2,23,7],[118,2,118,7],[119,2,119,7],[120,2,120,7],[121,2,121,7],[122,2,122,7],[123,2,123,7],[112,2,112,7],[113,2,113,7],[114,2,114,7],[115,2,115,7],[116,2,116,7],[117,2,117,7],[106,2,106,7],[107,2,107,7],[108,2,108,7],[109,2,109,7],[110,2,110,7],[111,2,111,7],[100,2,100,7],[101,2,101,7],[102,2,102,7],[103,2,103,7],[104,2,104,7],[105,2,105,7],[94,2,94,7],[95,2,95,7],[96,2,96,7],[97,2,97,7],[98,2,98,7],[99,2,99,7],[88,2,88,7],[89,2,89,7],[90,2,90,7],[91,2,91,7],[92,2,92,7],[93,2,93,7],[82,2,82,7],[83,2,83,7],[84,2,84,7],[85,2,85,7],[86,2,86,7],[87,2,87,7],[76,2,76,7],[77,2,77,7],[78,2,78,7],[79,2,79,7],[80,2,80,7],[81,2,81,7],[70,2,70,7],[71,2,71,7],[72,2,72,7],[73,2,73,7],[74,2,74,7],[75,2,75,7],[64,2,64,7],[65,2,65,7],[66,2,66,7],[67,2,67,7],[68,2,68,7],[69,2,69,7],[58,2,58,7],[59,2,59,7],[60,2,60,7],[61,2,61,7],[62,2,62,7],[63,2,63,7],[52,2,52,7],[53,2,53,7],[54,2,54,7],[55,2,55,7],[56,2,56,7],[57,2,57,7],[46,2,46,7],[47,2,47,7],[48,2,48,7],[49,2,49,7],[50,2,50,7],[51,2,51,7],[40,2,40,7],[41,2,41,7],[42,2,42,7],[43,2,43,7],[44,2,44,7],[45,2,45,7],[34,2,34,7],[35,2,35,7],[36,2,36,7],[37,2,37,7],[38,2,38,7],[39,2,39,7],[28,2,28,7],[29,2,29,7],[30,2,30,7],[31,2,31,7],[32,2,32,7],[33,2,33,7],[24,2,24,7],[25,2,25,7],[26,2,26,7],[27,2,27,7],[17,2,17,7],[18,2,18,7],[18,14,18,16],[19,2,19,7],[19,14,19,16],[18,9,18,12],[17,14,17,16],[17,9,17,12],[2,4,2,5],[4,4,4,7],[5,2,5,7],[6,2,6,7],[7,3,7,7],[8,2,8,7],[14,4,14,5],[15,4,15,5],[21,1,21,2],[21,5,21,7],[9,2,9,7],[11,3,11,7],[12,3,12,7],[14,2,14,3],[14,6,14,7],[15,2,15,3],[15,6,15,7]]}
[]
[null,null,"Offerte / Montage- en overige kosten"]
[]
[null,null,"Aanhef","Voorl.","Achternaam"]
[null,"Naam klant/contactpers.:",{"$f":"'Offerte goederen'!C5","v":0},{"$f":"'Offerte goederen'!D5","v":0},{"$f":"'Offerte goederen'!E5","v":0}]
[null,"Organisatie:",{"$f":"'Offerte goederen'!C6","v":0}]
[null,"Montage-adres:",{"$f":"'Offerte goederen'!C7","v":0}]
[null,"Postcode/Wplts.:",{"$f":"'Offerte goederen'!C8","v":0},{"$f":"'Offerte goederen'!D8","v":0}]
[null,"Land:",{"$f":"'Offerte goederen'!C9","v":0}]
[null,"E-mailadres:",{"$f":"'Offerte goederen'!C10","v":0}]
[null,null,"Landcode","Tel.nr."]
[null,"Telefoon 1:",{"$f":"'Offerte goederen'!C12","v":0},{"$f":"'Offerte goederen'!D12","v":0}]
[null,"Telefoon 2:",{"$f":"'Offerte goederen'!C13","v":0},{"$f":"'Offerte goederen'!D13","v":0}]
[]
[null,"Ingemeten op (1):",{"$f":"'Offerte goederen'!C15","v":"00:00:00"},null,"Offertedatum: ",null,{"$f":"'Offerte goederen'!G15","v":"00:00:00"}]
[null,"Ingemeten op (2):",{"$f":"'Offerte goederen'!C16","v":"00:00:00"},null,"Geldig t/m: ",null,{"$f":"'Offerte goederen'!G16","v":""}]
[]
[null,"Projectomschrijving klant:",{"$f":"'Offerte goederen'!C18","v":0},null,null,null,null,null,null,{"$f":"IF(R19=TRUE,\"Totaalbedrag montage- en overige kosten (excl. BTW): \",\"Totaalbedrag montage- en overige kosten (BTW verlegd): \")","v":"Totaalbedrag montage- en overige kosten (excl. BTW): "},null,null,null,null,{"$f":"SUM($Q25:$Q125)","v":0}]
[null,null,{"$f":"'Offerte goederen'!C19","v":0},null,null,null,null,null,null,{"$f":"IF(R19=TRUE,CONCATENATE(\"+ BTW (\",100*Formulierdata!A29,\"%): \"),\"\")","v":"+ BTW (21%): "},null,null,null,null,{"$f":"IF(R19=TRUE,Formulierdata!A29*O18,\"\")","v":0},null,null,true]
[null,null,{"$f":"'Offerte goederen'!C20","v":0},null,null,null,null,null,null,null,null,null,{"$f":"IF(R19=TRUE,\"Totaalbedrag montage- en overige kosten (incl. BTW): \",\"\")","v":"Totaalbedrag montage- en overige kosten (incl. BTW): "},null,{"$f":"IF(R19=TRUE,SUM(O18:Q19),\"\")","v":0}]
[]
[]
[]
[null,"Vertrek","Montage- en overige kosten",null,null,null,null,null,"#","Toelichting (evt.)",null,{"$f":"'Offerte goederen'!R24","v":"Prijs       (excl. BTW)"},"per",null,"Aantal\neenh.",null,"Bedrag\n(excl. BTW)",null,"Bedrag\n(incl. BTW)"]
[null,null,{"$f":"IF(I25=\"\",\"\",IF(ISERROR(VLOOKUP(I25,Prijslijst!A:B,2,FALSE)),\"Itemnummer onbekend\",VLOOKUP(I25,Prijslijst!A:B,2,FALSE)))","v":""},null,null,null,null,null,null,null,null,{"$f":"IF($I25=\"\",\"\",IF('Offerte goederen'!$W$22=1,VLOOKUP($I25,Prijslijst!A:E,5,FALSE),VLOOKUP($I25,Prijslijst!A:E,3,FALSE)))","v":""},{"$f":"IF(I25=\"\",\"\",VLOOKUP($I25,Prijslijst!A:D,4,FALSE))","v":""},null,null,null,{"$f":"IF(S25=\"\",\"\",(1/(1+Formulierdata!$A$29))*S25)","v":""},null,{"$f":"IF('Offerte goederen'!$W$22=1,IF(L25=\"\",\"\",IF(OR(O25=\"\",O25=0,O25=1),L25,L25*O25)),IF(L25=\"\",\"\",IF(OR(O25=\"\",O25=0,O25=1),L25*(1+Formulierdata!$A$29),L25*(1+Formulierdata!$A$29)*O25)))","v":""}]
[null,null,{"$f":"IF(I26=\"\",\"\",IF(ISERROR(VLOOKUP(I26,Prijslijst!A:B,2,FALSE)),\"Itemnummer onbekend\",VLOOKUP(I26,Prijslijst!A:B,2,FALSE)))","v":""},null,null,null,null,null,null,null,null,{"$f":"IF($I26=\"\",\"\",IF('Offerte goederen'!$W$22=1,VLOOKUP($I26,Prijslijst!A:E,5,FALSE),VLOOKUP($I26,Prijslijst!A:E,3,FALSE)))","v":""},{"$f":"IF(I26=\"\",\"\",VLOOKUP($I26,Prijslijst!A:D,4,FALSE))","v":""},null,null,null,{"$f":"IF(S26=\"\",\"\",(1/(1+Formulierdata!$A$29))*S26)","v":""},null,{"$f":"IF('Offerte goederen'!$W$22=1,IF(L26=\"\",\"\",IF(OR(O26=\"\",O26=0,O26=1),L26,L26*O26)),IF(L26=\"\",\"\",IF(OR(O26=\"\",O26=0,O26=1),L26*(1+Formulierdata!$A$29),L26*(1+Formulierdata!$A$29)*O26)))","v":""}]
[null,null,{"$f":"IF(I27=\"\",\"\",IF(ISERROR(VLOOKUP(I27,Prijslijst!A:B,2,FALSE)),\"Itemnummer onbekend\",VLOOKUP(I27,Prijslijst!A:B,2,FALSE)))","v":""},null,null,null,null,null,null,null,null,{"$f":"IF($I27=\"\",\"\",IF('Offerte goederen'!$W$22=1,VLOOKUP($I27,Prijslijst!A:E,5,FALSE),VLOOKUP($I27,Prijslijst!A:E,3,FALSE)))","v":""},{"$f":"IF(I27=\"\",\"\",VLOOKUP($I27,Prijslijst!A:D,4,FALSE))","v":""},null,null,null,{"$f":"IF(S27=\"\",\"\",(1/(1+Formulierdata!$A$29))*S27)","v":""},null,{"$f":"IF('Offerte goederen'!$W$22=1,IF(L27=\"\",\"\",IF(OR(O27=\"\",O27=0,O27=1),L27,L27*O27)),IF(L27=\"\",\"\",IF(OR(O27=\"\",O27=0,O27=1),L27*(1+Formulierdata!$A$29),L27*(1+Formulierdata!$A$29)*O27)))","v":""}]
[null,null,{"$f":"IF(I28=\"\",\"\",IF(ISERROR(VLOOKUP(I28,Prijslijst!A:B,2,FALSE)),\"Itemnummer onbekend\",VLOOKUP(I28,Prijslijst!A:B,2,FALSE)))","v":""},null,null,null,null,null,null,null,null,{"$f":"IF($I28=\"\",\"\",IF('Offerte goederen'!$W$22=1,VLOOKUP($I28,Prijslijst!A:E,5,FALSE),VLOOKUP($I28,Prijslijst!A:E,3,FALSE)))","v":""},{"$f":"IF(I28=\"\",\"\",VLOOKUP($I28,Prijslijst!A:D,4,FALSE))","v":""},null,null,null,{"$f":"IF(S28=\"\",\"\",(1/(1+Formulierdata!$A$29))*S28)","v":""},null,{"$f":"IF('Offerte goederen'!$W$22=1,IF(L28=\"\",\"\",IF(OR(O28=\"\",O28=0,O28=1),L28,L28*O28)),IF(L28=\"\",\"\",IF(OR(O28=\"\",O28=0,O28=1),L28*(1+Formulierdata!$A$29),L28*(1+Formulierdata!$A$29)*O28)))","v":""}]
[null,null,{"$f":"IF(I29=\"\",\"\",IF(ISERROR(VLOOKUP(I29,Prijslijst!A:B,2,FALSE)),\"Itemnummer onbekend\",VLOOKUP(I29,Prijslijst!A:B,2,FALSE)))","v":""},null,null,null,null,null,null,null,null,{"$f":"IF($I29=\"\",\"\",IF('Offerte goederen'!$W$22=1,VLOOKUP($I29,Prijslijst!A:E,5,FALSE),VLOOKUP($I29,Prijslijst!A:E,3,FALSE)))","v":""},{"$f":"IF(I29=\"\",\"\",VLOOKUP($I29,Prijslijst!A:D,4,FALSE))","v":""},null,null,null,{"$f":"IF(S29=\"\",\"\",(1/(1+Formulierdata!$A$29))*S29)","v":""},null,{"$f":"IF('Offerte goederen'!$W$22=1,IF(L29=\"\",\"\",IF(OR(O29=\"\",O29=0,O29=1),L29,L29*O29)),IF(L29=\"\",\"\",IF(OR(O29=\"\",O29=0,O29=1),L29*(1+Formulierdata!$A$29),L29*(1+Formulierdata!$A$29)*O29)))","v":""}]
[null,null,{"$f":"IF(I30=\"\",\"\",IF(ISERROR(VLOOKUP(I30,Prijslijst!A:B,2,FALSE)),\"Itemnummer onbekend\",VLOOKUP(I30,Prijslijst!A:B,2,FALSE)))","v":""},null,null,null,null,null,null,null,null,{"$f":"IF($I30=\"\",\"\",IF('Offerte goederen'!$W$22=1,VLOOKUP($I30,Prijslijst!A:E,5,FALSE),VLOOKUP($I30,Prijslijst!A:E,3,FALSE)))","v":""},{"$f":"IF(I30=\"\",\"\",VLOOKUP($I30,Prijslijst!A:D,4,FALSE))","v":""},null,null,null,{"$f":"IF(S30=\"\",\"\",(1/(1+Formulierdata!$A$29))*S30)","v":""},null,{"$f":"IF('Offerte goederen'!$W$22=1,IF(L30=\"\",\"\",IF(OR(O30=\"\",O30=0,O30=1),L30,L30*O30)),IF(L30=\"\",\"\",IF(OR(O30=\"\",O30=0,O30=1),L30*(1+Formulierdata!$A$29),L30*(1+Formulierdata!$A$29)*O30)))","v":""}]
[null,null,{"$f":"IF(I31=\"\",\"\",IF(ISERROR(VLOOKUP(I31,Prijslijst!A:B,2,FALSE)),\"Itemnummer onbekend\",VLOOKUP(I31,Prijslijst!A:B,2,FALSE)))","v":""},null,null,null,null,null,null,null,null,{"$f":"IF($I31=\"\",\"\",IF('Offerte goederen'!$W$22=1,VLOOKUP($I31,Prijslijst!A:E,5,FALSE),VLOOKUP($I31,Prijslijst!A:E,3,FALSE)))","v":""},{"$f":"IF(I31=\"\",\"\",VLOOKUP($I31,Prijslijst!A:D,4,FALSE))","v":""},null,null,null,{"$f":"IF(S31=\"\",\"\",(1/(1+Formulierdata!$A$29))*S31)","v":""},null,{"$f":"IF('Offerte goederen'!$W$22=1,IF(L31=\"\",\"\",IF(OR(O31=\"\",O31=0,O31=1),L31,L31*O31)),IF(L31=\"\",\"\",IF(OR(O31=\"\",O31=0,O31=1),L31*(1+Formulierdata!$A$29),L31*(1+Formulierdata!$A$29)*O31)))","v":""}]
[null,null,{"$f":"IF(I32=\"\",\"\",IF(ISERROR(VLOOKUP(I32,Prijslijst!A:B,2,FALSE)),\"Itemnummer onbekend\",VLOOKUP(I32,Prijslijst!A:B,2,FALSE)))","v":""},null,null,null,null,null,null,null,null,{"$f":"IF($I32=\"\",\"\",IF('Offerte goederen'!$W$22=1,VLOOKUP($I32,Prijslijst!A:E,5,FALSE),VLOOKUP($I32,Prijslijst!A:E,3,FALSE)))","v":""},{"$f":"IF(I32=\"\",\"\",VLOOKUP($I32,Prijslijst!A:D,4,FALSE))","v":""},null,null,null,{"$f":"IF(S32=\"\",\"\",(1/(1+Formulierdata!$A$29))*S32)","v":""},null,{"$f":"IF('Offerte goederen'!$W$22=1,IF(L32=\"\",\"\",IF(OR(O32=\"\",O32=0,O32=1),L32,L32*O32)),IF(L32=\"\",\"\",IF(OR(O32=\"\",O32=0,O32=1),L32*(1+Formulierdata!$A$29),L32*(1+Formulierdata!$A$29)*O32)))","v":""}]
[null,null,{"$f":"IF(I33=\"\",\"\",IF(ISERROR(VLOOKUP(I33,Prijslijst!A:B,2,FALSE)),\"Itemnummer onbekend\",VLOOKUP(I33,Prijslijst!A:B,2,FALSE)))","v":""},null,null,null,null,null,null,null,null,{"$f":"IF($I33=\"\",\"\",IF('Offerte goederen'!$W$22=1,VLOOKUP($I33,Prijslijst!A:E,5,FALSE),VLOOKUP($I33,Prijslijst!A:E,3,FALSE)))","v":""},{"$f":"IF(I33=\"\",\"\",VLOOKUP($I33,Prijslijst!A:D,4,FALSE))","v":""},null,null,null,{"$f":"IF(S33=\"\",\"\",(1/(1+Formulierdata!$A$29))*S33)","v":""},null,{"$f":"IF('Offerte goederen'!$W$22=1,IF(L33=\"\",\"\",IF(OR(O33=\"\",O33=0,O33=1),L33,L33*O33)),IF(L33=\"\",\"\",IF(OR(O33=\"\",O33=0,O33=1),L33*(1+Formulierdata!$A$29),L33*(1+Formulierdata!$A$29)*O33)))","v":""}]
[null,null,{"$f":"IF(I34=\"\",\"\",IF(ISERROR(VLOOKUP(I34,Prijslijst!A:B,2,FALSE)),\"Itemnummer onbekend\",VLOOKUP(I34,Prijslijst!A:B,2,FALSE)))","v":""},null,null,null,null,null,null,null,null,{"$f":"IF($I34=\"\",\"\",IF('Offerte goederen'!$W$22=1,VLOOKUP($I34,Prijslijst!A:E,5,FALSE),VLOOKUP($I34,Prijslijst!A:E,3,FALSE)))","v":""},{"$f":"IF(I34=\"\",\"\",VLOOKUP($I34,Prijslijst!A:D,4,FALSE))","v":""},null,null,null,{"$f":"IF(S34=\"\",\"\",(1/(1+Formulierdata!$A$29))*S34)","v":""},null,{"$f":"IF('Offerte goederen'!$W$22=1,IF(L34=\"\",\"\",IF(OR(O34=\"\",O34=0,O34=1),L34,L34*O34)),IF(L34=\"\",\"\",IF(OR(O34=\"\",O34=0,O34=1),L34*(1+Formulierdata!$A$29),L34*(1+Formulierdata!$A$29)*O34)))","v":""}]
[null,null,{"$f":"IF(I35=\"\",\"\",IF(ISERROR(VLOOKUP(I35,Prijslijst!A:B,2,FALSE)),\"Itemnummer onbekend\",VLOOKUP(I35,Prijslijst!A:B,2,FALSE)))","v":""},null,null,null,null,null,null,null,null,{"$f":"IF($I35=\"\",\"\",IF('Offerte goederen'!$W$22=1,VLOOKUP($I35,Prijslijst!A:E,5,FALSE),VLOOKUP($I35,Prijslijst!A:E,3,FALSE)))","v":""},{"$f":"IF(I35=\"\",\"\",VLOOKUP($I35,Prijslijst!A:D,4,FALSE))","v":""},null,null,null,{"$f":"IF(S35=\"\",\"\",(1/(1+Formulierdata!$A$29))*S35)","v":""},null,{"$f":"IF('Offerte goederen'!$W$22=1,IF(L35=\"\",\"\",IF(OR(O35=\"\",O35=0,O35=1),L35,L35*O35)),IF(L35=\"\",\"\",IF(OR(O35=\"\",O35=0,O35=1),L35*(1+Formulierdata!$A$29),L35*(1+Formulierdata!$A$29)*O35)))","v":""}]
[null,null,{"$f":"IF(I36=\"\",\"\",IF(ISERROR(VLOOKUP(I36,Prijslijst!A:B,2,FALSE)),\"Itemnummer onbekend\",VLOOKUP(I36,Prijslijst!A:B,2,FALSE)))","v":""},null,null,null,null,null,null,null,null,{"$f":"IF($I36=\"\",\"\",IF('Offerte goederen'!$W$22=1,VLOOKUP($I36,Prijslijst!A:E,5,FALSE),VLOOKUP($I36,Prijslijst!A:E,3,FALSE)))","v":""},{"$f":"IF(I36=\"\",\"\",VLOOKUP($I36,Prijslijst!A:D,4,FALSE))","v":""},null,null,null,{"$f":"IF(S36=\"\",\"\",(1/(1+Formulierdata!$A$29))*S36)","v":""},null,{"$f":"IF('Offerte goederen'!$W$22=1,IF(L36=\"\",\"\",IF(OR(O36=\"\",O36=0,O36=1),L36,L36*O36)),IF(L36=\"\",\"\",IF(OR(O36=\"\",O36=0,O36=1),L36*(1+Formulierdata!$A$29),L36*(1+Formulierdata!$A$29)*O36)))","v":""}]
[null,null,{"$f":"IF(I37=\"\",\"\",IF(ISERROR(VLOOKUP(I37,Prijslijst!A:B,2,FALSE)),\"Itemnummer onbekend\",VLOOKUP(I37,Prijslijst!A:B,2,FALSE)))","v":""},null,null,null,null,null,null,null,null,{"$f":"IF($I37=\"\",\"\",IF('Offerte goederen'!$W$22=1,VLOOKUP($I37,Prijslijst!A:E,5,FALSE),VLOOKUP($I37,Prijslijst!A:E,3,FALSE)))","v":""},{"$f":"IF(I37=\"\",\"\",VLOOKUP($I37,Prijslijst!A:D,4,FALSE))","v":""},null,null,null,{"$f":"IF(S37=\"\",\"\",(1/(1+Formulierdata!$A$29))*S37)","v":""},null,{"$f":"IF('Offerte goederen'!$W$22=1,IF(L37=\"\",\"\",IF(OR(O37=\"\",O37=0,O37=1),L37,L37*O37)),IF(L37=\"\",\"\",IF(OR(O37=\"\",O37=0,O37=1),L37*(1+Formulierdata!$A$29),L37*(1+Formulierdata!$A$29)*O37)))","v":""}]
[null,null,{"$f":"IF(I38=\"\",\"\",IF(ISERROR(VLOOKUP(I38,Prijslijst!A:B,2,FALSE)),\"Itemnummer onbekend\",VLOOKUP(I38,Prijslijst!A:B,2,FALSE)))","v":""},null,null,null,null,null,null,null,null,{"$f":"IF($I38=\"\",\"\",IF('Offerte goederen'!$W$22=1,VLOOKUP($I38,Prijslijst!A:E,5,FALSE),VLOOKUP($I38,Prijslijst!A:E,3,FALSE)))","v":""},{"$f":"IF(I38=\"\",\"\",VLOOKUP($I38,Prijslijst!A:D,4,FALSE))","v":""},null,null,null,{"$f":"IF(S38=\"\",\"\",(1/(1+Formulierdata!$A$29))*S38)","v":""},null,{"$f":"IF('Offerte goederen'!$W$22=1,IF(L38=\"\",\"\",IF(OR(O38=\"\",O38=0,O38=1),L38,L38*O38)),IF(L38=\"\",\"\",IF(OR(O38=\"\",O38=0,O38=1),L38*(1+Formulierdata!$A$29),L38*(1+Formulierdata!$A$29)*O38)))","v":""}]
[null,null,{"$f":"IF(I39=\"\",\"\",IF(ISERROR(VLOOKUP(I39,Prijslijst!A:B,2,FALSE)),\"Itemnummer onbekend\",VLOOKUP(I39,Prijslijst!A:B,2,FALSE)))","v":""},null,null,null,null,null,null,null,null,{"$f":"IF($I39=\"\",\"\",IF('Offerte goederen'!$W$22=1,VLOOKUP($I39,Prijslijst!A:E,5,FALSE),VLOOKUP($I39,Prijslijst!A:E,3,FALSE)))","v":""},{"$f":"IF(I39=\"\",\"\",VLOOKUP($I39,Prijslijst!A:D,4,FALSE))","v":""},null,null,null,{"$f":"IF(S39=\"\",\"\",(1/(1+Formulierdata!$A$29))*S39)","v":""},null,{"$f":"IF('Offerte goederen'!$W$22=1,IF(L39=\"\",\"\",IF(OR(O39=\"\",O39=0,O39=1),L39,L39*O39)),IF(L39=\"\",\"\",IF(OR(O39=\"\",O39=0,O39=1),L39*(1+Formulierdata!$A$29),L39*(1+Formulierdata!$A$29)*O39)))","v":""}]
[null,null,{"$f":"IF(I40=\"\",\"\",IF(ISERROR(VLOOKUP(I40,Prijslijst!A:B,2,FALSE)),\"Itemnummer onbekend\",VLOOKUP(I40,Prijslijst!A:B,2,FALSE)))","v":""},null,null,null,null,null,null,null,null,{"$f":"IF($I40=\"\",\"\",IF('Offerte goederen'!$W$22=1,VLOOKUP($I40,Prijslijst!A:E,5,FALSE),VLOOKUP($I40,Prijslijst!A:E,3,FALSE)))","v":""},{"$f":"IF(I40=\"\",\"\",VLOOKUP($I40,Prijslijst!A:D,4,FALSE))","v":""},null,null,null,{"$f":"IF(S40=\"\",\"\",(1/(1+Formulierdata!$A$29))*S40)","v":""},null,{"$f":"IF('Offerte goederen'!$W$22=1,IF(L40=\"\",\"\",IF(OR(O40=\"\",O40=0,O40=1),L40,L40*O40)),IF(L40=\"\",\"\",IF(OR(O40=\"\",O40=0,O40=1),L40*(1+Formulierdata!$A$29),L40*(1+Formulierdata!$A$29)*O40)))","v":""}]
[null,null,{"$f":"IF(I41=\"\",\"\",IF(ISERROR(VLOOKUP(I41,Prijslijst!A:B,2,FALSE)),\"Itemnummer onbekend\",VLOOKUP(I41,Prijslijst!A:B,2,FALSE)))","v":""},null,null,null,null,null,null,null,null,{"$f":"IF($I41=\"\",\"\",IF('Offerte goederen'!$W$22=1,VLOOKUP($I41,Prijslijst!A:E,5,FALSE),VLOOKUP($I41,Prijslijst!A:E,3,FALSE)))","v":""},{"$f":"IF(I41=\"\",\"\",VLOOKUP($I41,Prijslijst!A:D,4,FALSE))","v":""},null,null,null,{"$f":"IF(S41=\"\",\"\",(1/(1+Formulierdata!$A$29))*S41)","v":""},null,{"$f":"IF('Offerte goederen'!$W$22=1,IF(L41=\"\",\"\",IF(OR(O41=\"\",O41=0,O41=1),L41,L41*O41)),IF(L41=\"\",\"\",IF(OR(O41=\"\",O41=0,O41=1),L41*(1+Formulierdata!$A$29),L41*(1+Formulierdata!$A$29)*O41)))","v":""}]
[null,null,{"$f":"IF(I42=\"\",\"\",IF(ISERROR(VLOOKUP(I42,Prijslijst!A:B,2,FALSE)),\"Itemnummer onbekend\",VLOOKUP(I42,Prijslijst!A:B,2,FALSE)))","v":""},null,null,null,null,null,null,null,null,{"$f":"IF($I42=\"\",\"\",IF('Offerte goederen'!$W$22=1,VLOOKUP($I42,Prijslijst!A:E,5,FALSE),VLOOKUP($I42,Prijslijst!A:E,3,FALSE)))","v":""},{"$f":"IF(I42=\"\",\"\",VLOOKUP($I42,Prijslijst!A:D,4,FALSE))","v":""},null,null,null,{"$f":"IF(S42=\"\",\"\",(1/(1+Formulierdata!$A$29))*S42)","v":""},null,{"$f":"IF('Offerte goederen'!$W$22=1,IF(L42=\"\",\"\",IF(OR(O42=\"\",O42=0,O42=1),L42,L42*O42)),IF(L42=\"\",\"\",IF(OR(O42=\"\",O42=0,O42=1),L42*(1+Formulierdata!$A$29),L42*(1+Formulierdata!$A$29)*O42)))","v":""}]
[null,null,{"$f":"IF(I43=\"\",\"\",IF(ISERROR(VLOOKUP(I43,Prijslijst!A:B,2,FALSE)),\"Itemnummer onbekend\",VLOOKUP(I43,Prijslijst!A:B,2,FALSE)))","v":""},null,null,null,null,null,null,null,null,{"$f":"IF($I43=\"\",\"\",IF('Offerte goederen'!$W$22=1,VLOOKUP($I43,Prijslijst!A:E,5,FALSE),VLOOKUP($I43,Prijslijst!A:E,3,FALSE)))","v":""},{"$f":"IF(I43=\"\",\"\",VLOOKUP($I43,Prijslijst!A:D,4,FALSE))","v":""},null,null,null,{"$f":"IF(S43=\"\",\"\",(1/(1+Formulierdata!$A$29))*S43)","v":""},null,{"$f":"IF('Offerte goederen'!$W$22=1,IF(L43=\"\",\"\",IF(OR(O43=\"\",O43=0,O43=1),L43,L43*O43)),IF(L43=\"\",\"\",IF(OR(O43=\"\",O43=0,O43=1),L43*(1+Formulierdata!$A$29),L43*(1+Formulierdata!$A$29)*O43)))","v":""}]
[null,null,{"$f":"IF(I44=\"\",\"\",IF(ISERROR(VLOOKUP(I44,Prijslijst!A:B,2,FALSE)),\"Itemnummer onbekend\",VLOOKUP(I44,Prijslijst!A:B,2,FALSE)))","v":""},null,null,null,null,null,null,null,null,{"$f":"IF($I44=\"\",\"\",IF('Offerte goederen'!$W$22=1,VLOOKUP($I44,Prijslijst!A:E,5,FALSE),VLOOKUP($I44,Prijslijst!A:E,3,FALSE)))","v":""},{"$f":"IF(I44=\"\",\"\",VLOOKUP($I44,Prijslijst!A:D,4,FALSE))","v":""},null,null,null,{"$f":"IF(S44=\"\",\"\",(1/(1+Formulierdata!$A$29))*S44)","v":""},null,{"$f":"IF('Offerte goederen'!$W$22=1,IF(L44=\"\",\"\",IF(OR(O44=\"\",O44=0,O44=1),L44,L44*O44)),IF(L44=\"\",\"\",IF(OR(O44=\"\",O44=0,O44=1),L44*(1+Formulierdata!$A$29),L44*(1+Formulierdata!$A$29)*O44)))","v":""}]
[null,null,{"$f":"IF(I45=\"\",\"\",IF(ISERROR(VLOOKUP(I45,Prijslijst!A:B,2,FALSE)),\"Itemnummer onbekend\",VLOOKUP(I45,Prijslijst!A:B,2,FALSE)))","v":""},null,null,null,null,null,null,null,null,{"$f":"IF($I45=\"\",\"\",IF('Offerte goederen'!$W$22=1,VLOOKUP($I45,Prijslijst!A:E,5,FALSE),VLOOKUP($I45,Prijslijst!A:E,3,FALSE)))","v":""},{"$f":"IF(I45=\"\",\"\",VLOOKUP($I45,Prijslijst!A:D,4,FALSE))","v":""},null,null,null,{"$f":"IF(S45=\"\",\"\",(1/(1+Formulierdata!$A$29))*S45)","v":""},null,{"$f":"IF('Offerte goederen'!$W$22=1,IF(L45=\"\",\"\",IF(OR(O45=\"\",O45=0,O45=1),L45,L45*O45)),IF(L45=\"\",\"\",IF(OR(O45=\"\",O45=0,O45=1),L45*(1+Formulierdata!$A$29),L45*(1+Formulierdata!$A$29)*O45)))","v":""}]
[null,null,{"$f":"IF(I46=\"\",\"\",IF(ISERROR(VLOOKUP(I46,Prijslijst!A:B,2,FALSE)),\"Itemnummer onbekend\",VLOOKUP(I46,Prijslijst!A:B,2,FALSE)))","v":""},null,null,null,null,null,null,null,null,{"$f":"IF($I46=\"\",\"\",IF('Offerte goederen'!$W$22=1,VLOOKUP($I46,Prijslijst!A:E,5,FALSE),VLOOKUP($I46,Prijslijst!A:E,3,FALSE)))","v":""},{"$f":"IF(I46=\"\",\"\",VLOOKUP($I46,Prijslijst!A:D,4,FALSE))","v":""},null,null,null,{"$f":"IF(S46=\"\",\"\",(1/(1+Formulierdata!$A$29))*S46)","v":""},null,{"$f":"IF('Offerte goederen'!$W$22=1,IF(L46=\"\",\"\",IF(OR(O46=\"\",O46=0,O46=1),L46,L46*O46)),IF(L46=\"\",\"\",IF(OR(O46=\"\",O46=0,O46=1),L46*(1+Formulierdata!$A$29),L46*(1+Formulierdata!$A$29)*O46)))","v":""}]
[null,null,{"$f":"IF(I47=\"\",\"\",IF(ISERROR(VLOOKUP(I47,Prijslijst!A:B,2,FALSE)),\"Itemnummer onbekend\",VLOOKUP(I47,Prijslijst!A:B,2,FALSE)))","v":""},null,null,null,null,null,null,null,null,{"$f":"IF($I47=\"\",\"\",IF('Offerte goederen'!$W$22=1,VLOOKUP($I47,Prijslijst!A:E,5,FALSE),VLOOKUP($I47,Prijslijst!A:E,3,FALSE)))","v":""},{"$f":"IF(I47=\"\",\"\",VLOOKUP($I47,Prijslijst!A:D,4,FALSE))","v":""},null,null,null,{"$f":"IF(S47=\"\",\"\",(1/(1+Formulierdata!$A$29))*S47)","v":""},null,{"$f":"IF('Offerte goederen'!$W$22=1,IF(L47=\"\",\"\",IF(OR(O47=\"\",O47=0,O47=1),L47,L47*O47)),IF(L47=\"\",\"\",IF(OR(O47=\"\",O47=0,O47=1),L47*(1+Formulierdata!$A$29),L47*(1+Formulierdata!$A$29)*O47)))","v":""}]
[null,null,{"$f":"IF(I48=\"\",\"\",IF(ISERROR(VLOOKUP(I48,Prijslijst!A:B,2,FALSE)),\"Itemnummer onbekend\",VLOOKUP(I48,Prijslijst!A:B,2,FALSE)))","v":""},null,null,null,null,null,null,null,null,{"$f":"IF($I48=\"\",\"\",IF('Offerte goederen'!$W$22=1,VLOOKUP($I48,Prijslijst!A:E,5,FALSE),VLOOKUP($I48,Prijslijst!A:E,3,FALSE)))","v":""},{"$f":"IF(I48=\"\",\"\",VLOOKUP($I48,Prijslijst!A:D,4,FALSE))","v":""},null,null,null,{"$f":"IF(S48=\"\",\"\",(1/(1+Formulierdata!$A$29))*S48)","v":""},null,{"$f":"IF('Offerte goederen'!$W$22=1,IF(L48=\"\",\"\",IF(OR(O48=\"\",O48=0,O48=1),L48,L48*O48)),IF(L48=\"\",\"\",IF(OR(O48=\"\",O48=0,O48=1),L48*(1+Formulierdata!$A$29),L48*(1+Formulierdata!$A$29)*O48)))","v":""}]
[null,null,{"$f":"IF(I49=\"\",\"\",IF(ISERROR(VLOOKUP(I49,Prijslijst!A:B,2,FALSE)),\"Itemnummer onbekend\",VLOOKUP(I49,Prijslijst!A:B,2,FALSE)))","v":""},null,null,null,null,null,null,null,null,{"$f":"IF($I49=\"\",\"\",IF('Offerte goederen'!$W$22=1,VLOOKUP($I49,Prijslijst!A:E,5,FALSE),VLOOKUP($I49,Prijslijst!A:E,3,FALSE)))","v":""},{"$f":"IF(I49=\"\",\"\",VLOOKUP($I49,Prijslijst!A:D,4,FALSE))","v":""},null,null,null,{"$f":"IF(S49=\"\",\"\",(1/(1+Formulierdata!$A$29))*S49)","v":""},null,{"$f":"IF('Offerte goederen'!$W$22=1,IF(L49=\"\",\"\",IF(OR(O49=\"\",O49=0,O49=1),L49,L49*O49)),IF(L49=\"\",\"\",IF(OR(O49=\"\",O49=0,O49=1),L49*(1+Formulierdata!$A$29),L49*(1+Formulierdata!$A$29)*O49)))","v":""}]
[null,null,{"$f":"IF(I50=\"\",\"\",IF(ISERROR(VLOOKUP(I50,Prijslijst!A:B,2,FALSE)),\"Itemnummer onbekend\",VLOOKUP(I50,Prijslijst!A:B,2,FALSE)))","v":""},null,null,null,null,null,null,null,null,{"$f":"IF($I50=\"\",\"\",IF('Offerte goederen'!$W$22=1,VLOOKUP($I50,Prijslijst!A:E,5,FALSE),VLOOKUP($I50,Prijslijst!A:E,3,FALSE)))","v":""},{"$f":"IF(I50=\"\",\"\",VLOOKUP($I50,Prijslijst!A:D,4,FALSE))","v":""},null,null,null,{"$f":"IF(S50=\"\",\"\",(1/(1+Formulierdata!$A$29))*S50)","v":""},null,{"$f":"IF('Offerte goederen'!$W$22=1,IF(L50=\"\",\"\",IF(OR(O50=\"\",O50=0,O50=1),L50,L50*O50)),IF(L50=\"\",\"\",IF(OR(O50=\"\",O50=0,O50=1),L50*(1+Formulierdata!$A$29),L50*(1+Formulierdata!$A$29)*O50)))","v":""}]
[null,null,{"$f":"IF(I51=\"\",\"\",IF(ISERROR(VLOOKUP(I51,Prijslijst!A:B,2,FALSE)),\"Itemnummer onbekend\",VLOOKUP(I51,Prijslijst!A:B,2,FALSE)))","v":""},null,null,null,null,null,null,null,null,{"$f":"IF($I51=\"\",\"\",IF('Offerte goederen'!$W$22=1,VLOOKUP($I51,Prijslijst!A:E,5,FALSE),VLOOKUP($I51,Prijslijst!A:E,3,FALSE)))","v":""},{"$f":"IF(I51=\"\",\"\",VLOOKUP($I51,Prijslijst!A:D,4,FALSE))","v":""},null,null,null,{"$f":"IF(S51=\"\",\"\",(1/(1+Formulierdata!$A$29))*S51)","v":""},null,{"$f":"IF('Offerte goederen'!$W$22=1,IF(L51=\"\",\"\",IF(OR(O51=\"\",O51=0,O51=1),L51,L51*O51)),IF(L51=\"\",\"\",IF(OR(O51=\"\",O51=0,O51=1),L51*(1+Formulierdata!$A$29),L51*(1+Formulierdata!$A$29)*O51)))","v":""}]
[null,null,{"$f":"IF(I52=\"\",\"\",IF(ISERROR(VLOOKUP(I52,Prijslijst!A:B,2,FALSE)),\"Itemnummer onbekend\",VLOOKUP(I52,Prijslijst!A:B,2,FALSE)))","v":""},null,null,null,null,null,null,null,null,{"$f":"IF($I52=\"\",\"\",IF('Offerte goederen'!$W$22=1,VLOOKUP($I52,Prijslijst!A:E,5,FALSE),VLOOKUP($I52,Prijslijst!A:E,3,FALSE)))","v":""},{"$f":"IF(I52=\"\",\"\",VLOOKUP($I52,Prijslijst!A:D,4,FALSE))","v":""},null,null,null,{"$f":"IF(S52=\"\",\"\",(1/(1+Formulierdata!$A$29))*S52)","v":""},null,{"$f":"IF('Offerte goederen'!$W$22=1,IF(L52=\"\",\"\",IF(OR(O52=\"\",O52=0,O52=1),L52,L52*O52)),IF(L52=\"\",\"\",IF(OR(O52=\"\",O52=0,O52=1),L52*(1+Formulierdata!$A$29),L52*(1+Formulierdata!$A$29)*O52)))","v":""}]
[null,null,{"$f":"IF(I53=\"\",\"\",IF(ISERROR(VLOOKUP(I53,Prijslijst!A:B,2,FALSE)),\"Itemnummer onbekend\",VLOOKUP(I53,Prijslijst!A:B,2,FALSE)))","v":""},null,null,null,null,null,null,null,null,{"$f":"IF($I53=\"\",\"\",IF('Offerte goederen'!$W$22=1,VLOOKUP($I53,Prijslijst!A:E,5,FALSE),VLOOKUP($I53,Prijslijst!A:E,3,FALSE)))","v":""},{"$f":"IF(I53=\"\",\"\",VLOOKUP($I53,Prijslijst!A:D,4,FALSE))","v":""},null,null,null,{"$f":"IF(S53=\"\",\"\",(1/(1+Formulierdata!$A$29))*S53)","v":""},null,{"$f":"IF('Offerte goederen'!$W$22=1,IF(L53=\"\",\"\",IF(OR(O53=\"\",O53=0,O53=1),L53,L53*O53)),IF(L53=\"\",\"\",IF(OR(O53=\"\",O53=0,O53=1),L53*(1+Formulierdata!$A$29),L53*(1+Formulierdata!$A$29)*O53)))","v":""}]
[null,null,{"$f":"IF(I54=\"\",\"\",IF(ISERROR(VLOOKUP(I54,Prijslijst!A:B,2,FALSE)),\"Itemnummer onbekend\",VLOOKUP(I54,Prijslijst!A:B,2,FALSE)))","v":""},null,null,null,null,null,null,null,null,{"$f":"IF($I54=\"\",\"\",IF('Offerte goederen'!$W$22=1,VLOOKUP($I54,Prijslijst!A:E,5,FALSE),VLOOKUP($I54,Prijslijst!A:E,3,FALSE)))","v":""},{"$f":"IF(I54=\"\",\"\",VLOOKUP($I54,Prijslijst!A:D,4,FALSE))","v":""},null,null,null,{"$f":"IF(S54=\"\",\"\",(1/(1+Formulierdata!$A$29))*S54)","v":""},null,{"$f":"IF('Offerte goederen'!$W$22=1,IF(L54=\"\",\"\",IF(OR(O54=\"\",O54=0,O54=1),L54,L54*O54)),IF(L54=\"\",\"\",IF(OR(O54=\"\",O54=0,O54=1),L54*(1+Formulierdata!$A$29),L54*(1+Formulierdata!$A$29)*O54)))","v":""}]
[null,null,{"$f":"IF(I55=\"\",\"\",IF(ISERROR(VLOOKUP(I55,Prijslijst!A:B,2,FALSE)),\"Itemnummer onbekend\",VLOOKUP(I55,Prijslijst!A:B,2,FALSE)))","v":""},null,null,null,null,null,null,null,null,{"$f":"IF($I55=\"\",\"\",IF('Offerte goederen'!$W$22=1,VLOOKUP($I55,Prijslijst!A:E,5,FALSE),VLOOKUP($I55,Prijslijst!A:E,3,FALSE)))","v":""},{"$f":"IF(I55=\"\",\"\",VLOOKUP($I55,Prijslijst!A:D,4,FALSE))","v":""},null,null,null,{"$f":"IF(S55=\"\",\"\",(1/(1+Formulierdata!$A$29))*S55)","v":""},null,{"$f":"IF('Offerte goederen'!$W$22=1,IF(L55=\"\",\"\",IF(OR(O55=\"\",O55=0,O55=1),L55,L55*O55)),IF(L55=\"\",\"\",IF(OR(O55=\"\",O55=0,O55=1),L55*(1+Formulierdata!$A$29),L55*(1+Formulierdata!$A$29)*O55)))","v":""}]
[null,null,{"$f":"IF(I56=\"\",\"\",IF(ISERROR(VLOOKUP(I56,Prijslijst!A:B,2,FALSE)),\"Itemnummer onbekend\",VLOOKUP(I56,Prijslijst!A:B,2,FALSE)))","v":""},null,null,null,null,null,null,null,null,{"$f":"IF($I56=\"\",\"\",IF('Offerte goederen'!$W$22=1,VLOOKUP($I56,Prijslijst!A:E,5,FALSE),VLOOKUP($I56,Prijslijst!A:E,3,FALSE)))","v":""},{"$f":"IF(I56=\"\",\"\",VLOOKUP($I56,Prijslijst!A:D,4,FALSE))","v":""},null,null,null,{"$f":"IF(S56=\"\",\"\",(1/(1+Formulierdata!$A$29))*S56)","v":""},null,{"$f":"IF('Offerte goederen'!$W$22=1,IF(L56=\"\",\"\",IF(OR(O56=\"\",O56=0,O56=1),L56,L56*O56)),IF(L56=\"\",\"\",IF(OR(O56=\"\",O56=0,O56=1),L56*(1+Formulierdata!$A$29),L56*(1+Formulierdata!$A$29)*O56)))","v":""}]
[null,null,{"$f":"IF(I57=\"\",\"\",IF(ISERROR(VLOOKUP(I57,Prijslijst!A:B,2,FALSE)),\"Itemnummer onbekend\",VLOOKUP(I57,Prijslijst!A:B,2,FALSE)))","v":""},null,null,null,null,null,null,null,null,{"$f":"IF($I57=\"\",\"\",IF('Offerte goederen'!$W$22=1,VLOOKUP($I57,Prijslijst!A:E,5,FALSE),VLOOKUP($I57,Prijslijst!A:E,3,FALSE)))","v":""},{"$f":"IF(I57=\"\",\"\",VLOOKUP($I57,Prijslijst!A:D,4,FALSE))","v":""},null,null,null,{"$f":"IF(S57=\"\",\"\",(1/(1+Formulierdata!$A$29))*S57)","v":""},null,{"$f":"IF('Offerte goederen'!$W$22=1,IF(L57=\"\",\"\",IF(OR(O57=\"\",O57=0,O57=1),L57,L57*O57)),IF(L57=\"\",\"\",IF(OR(O57=\"\",O57=0,O57=1),L57*(1+Formulierdata!$A$29),L57*(1+Formulierdata!$A$29)*O57)))","v":""}]
[null,null,{"$f":"IF(I58=\"\",\"\",IF(ISERROR(VLOOKUP(I58,Prijslijst!A:B,2,FALSE)),\"Itemnummer onbekend\",VLOOKUP(I58,Prijslijst!A:B,2,FALSE)))","v":""},null,null,null,null,null,null,null,null,{"$f":"IF($I58=\"\",\"\",IF('Offerte goederen'!$W$22=1,VLOOKUP($I58,Prijslijst!A:E,5,FALSE),VLOOKUP($I58,Prijslijst!A:E,3,FALSE)))","v":""},{"$f":"IF(I58=\"\",\"\",VLOOKUP($I58,Prijslijst!A:D,4,FALSE))","v":""},null,null,null,{"$f":"IF(S58=\"\",\"\",(1/(1+Formulierdata!$A$29))*S58)","v":""},null,{"$f":"IF('Offerte goederen'!$W$22=1,IF(L58=\"\",\"\",IF(OR(O58=\"\",O58=0,O58=1),L58,L58*O58)),IF(L58=\"\",\"\",IF(OR(O58=\"\",O58=0,O58=1),L58*(1+Formulierdata!$A$29),L58*(1+Formulierdata!$A$29)*O58)))","v":""}]
[null,null,{"$f":"IF(I59=\"\",\"\",IF(ISERROR(VLOOKUP(I59,Prijslijst!A:B,2,FALSE)),\"Itemnummer onbekend\",VLOOKUP(I59,Prijslijst!A:B,2,FALSE)))","v":""},null,null,null,null,null,null,null,null,{"$f":"IF($I59=\"\",\"\",IF('Offerte goederen'!$W$22=1,VLOOKUP($I59,Prijslijst!A:E,5,FALSE),VLOOKUP($I59,Prijslijst!A:E,3,FALSE)))","v":""},{"$f":"IF(I59=\"\",\"\",VLOOKUP($I59,Prijslijst!A:D,4,FALSE))","v":""},null,null,null,{"$f":"IF(S59=\"\",\"\",(1/(1+Formulierdata!$A$29))*S59)","v":""},null,{"$f":"IF('Offerte goederen'!$W$22=1,IF(L59=\"\",\"\",IF(OR(O59=\"\",O59=0,O59=1),L59,L59*O59)),IF(L59=\"\",\"\",IF(OR(O59=\"\",O59=0,O59=1),L59*(1+Formulierdata!$A$29),L59*(1+Formulierdata!$A$29)*O59)))","v":""}]
[null,null,{"$f":"IF(I60=\"\",\"\",IF(ISERROR(VLOOKUP(I60,Prijslijst!A:B,2,FALSE)),\"Itemnummer onbekend\",VLOOKUP(I60,Prijslijst!A:B,2,FALSE)))","v":""},null,null,null,null,null,null,null,null,{"$f":"IF($I60=\"\",\"\",IF('Offerte goederen'!$W$22=1,VLOOKUP($I60,Prijslijst!A:E,5,FALSE),VLOOKUP($I60,Prijslijst!A:E,3,FALSE)))","v":""},{"$f":"IF(I60=\"\",\"\",VLOOKUP($I60,Prijslijst!A:D,4,FALSE))","v":""},null,null,null,{"$f":"IF(S60=\"\",\"\",(1/(1+Formulierdata!$A$29))*S60)","v":""},null,{"$f":"IF('Offerte goederen'!$W$22=1,IF(L60=\"\",\"\",IF(OR(O60=\"\",O60=0,O60=1),L60,L60*O60)),IF(L60=\"\",\"\",IF(OR(O60=\"\",O60=0,O60=1),L60*(1+Formulierdata!$A$29),L60*(1+Formulierdata!$A$29)*O60)))","v":""}]
[null,null,{"$f":"IF(I61=\"\",\"\",IF(ISERROR(VLOOKUP(I61,Prijslijst!A:B,2,FALSE)),\"Itemnummer onbekend\",VLOOKUP(I61,Prijslijst!A:B,2,FALSE)))","v":""},null,null,null,null,null,null,null,null,{"$f":"IF($I61=\"\",\"\",IF('Offerte goederen'!$W$22=1,VLOOKUP($I61,Prijslijst!A:E,5,FALSE),VLOOKUP($I61,Prijslijst!A:E,3,FALSE)))","v":""},{"$f":"IF(I61=\"\",\"\",VLOOKUP($I61,Prijslijst!A:D,4,FALSE))","v":""},null,null,null,{"$f":"IF(S61=\"\",\"\",(1/(1+Formulierdata!$A$29))*S61)","v":""},null,{"$f":"IF('Offerte goederen'!$W$22=1,IF(L61=\"\",\"\",IF(OR(O61=\"\",O61=0,O61=1),L61,L61*O61)),IF(L61=\"\",\"\",IF(OR(O61=\"\",O61=0,O61=1),L61*(1+Formulierdata!$A$29),L61*(1+Formulierdata!$A$29)*O61)))","v":""}]
[null,null,{"$f":"IF(I62=\"\",\"\",IF(ISERROR(VLOOKUP(I62,Prijslijst!A:B,2,FALSE)),\"Itemnummer onbekend\",VLOOKUP(I62,Prijslijst!A:B,2,FALSE)))","v":""},null,null,null,null,null,null,null,null,{"$f":"IF($I62=\"\",\"\",IF('Offerte goederen'!$W$22=1,VLOOKUP($I62,Prijslijst!A:E,5,FALSE),VLOOKUP($I62,Prijslijst!A:E,3,FALSE)))","v":""},{"$f":"IF(I62=\"\",\"\",VLOOKUP($I62,Prijslijst!A:D,4,FALSE))","v":""},null,null,null,{"$f":"IF(S62=\"\",\"\",(1/(1+Formulierdata!$A$29))*S62)","v":""},null,{"$f":"IF('Offerte goederen'!$W$22=1,IF(L62=\"\",\"\",IF(OR(O62=\"\",O62=0,O62=1),L62,L62*O62)),IF(L62=\"\",\"\",IF(OR(O62=\"\",O62=0,O62=1),L62*(1+Formulierdata!$A$29),L62*(1+Formulierdata!$A$29)*O62)))","v":""}]
[null,null,{"$f":"IF(I63=\"\",\"\",IF(ISERROR(VLOOKUP(I63,Prijslijst!A:B,2,FALSE)),\"Itemnummer onbekend\",VLOOKUP(I63,Prijslijst!A:B,2,FALSE)))","v":""},null,null,null,null,null,null,null,null,{"$f":"IF($I63=\"\",\"\",IF('Offerte goederen'!$W$22=1,VLOOKUP($I63,Prijslijst!A:E,5,FALSE),VLOOKUP($I63,Prijslijst!A:E,3,FALSE)))","v":""},{"$f":"IF(I63=\"\",\"\",VLOOKUP($I63,Prijslijst!A:D,4,FALSE))","v":""},null,null,null,{"$f":"IF(S63=\"\",\"\",(1/(1+Formulierdata!$A$29))*S63)","v":""},null,{"$f":"IF('Offerte goederen'!$W$22=1,IF(L63=\"\",\"\",IF(OR(O63=\"\",O63=0,O63=1),L63,L63*O63)),IF(L63=\"\",\"\",IF(OR(O63=\"\",O63=0,O63=1),L63*(1+Formulierdata!$A$29),L63*(1+Formulierdata!$A$29)*O63)))","v":""}]
[null,null,{"$f":"IF(I64=\"\",\"\",IF(ISERROR(VLOOKUP(I64,Prijslijst!A:B,2,FALSE)),\"Itemnummer onbekend\",VLOOKUP(I64,Prijslijst!A:B,2,FALSE)))","v":""},null,null,null,null,null,null,null,null,{"$f":"IF($I64=\"\",\"\",IF('Offerte goederen'!$W$22=1,VLOOKUP($I64,Prijslijst!A:E,5,FALSE),VLOOKUP($I64,Prijslijst!A:E,3,FALSE)))","v":""},{"$f":"IF(I64=\"\",\"\",VLOOKUP($I64,Prijslijst!A:D,4,FALSE))","v":""},null,null,null,{"$f":"IF(S64=\"\",\"\",(1/(1+Formulierdata!$A$29))*S64)","v":""},null,{"$f":"IF('Offerte goederen'!$W$22=1,IF(L64=\"\",\"\",IF(OR(O64=\"\",O64=0,O64=1),L64,L64*O64)),IF(L64=\"\",\"\",IF(OR(O64=\"\",O64=0,O64=1),L64*(1+Formulierdata!$A$29),L64*(1+Formulierdata!$A$29)*O64)))","v":""}]
[null,null,{"$f":"IF(I65=\"\",\"\",IF(ISERROR(VLOOKUP(I65,Prijslijst!A:B,2,FALSE)),\"Itemnummer onbekend\",VLOOKUP(I65,Prijslijst!A:B,2,FALSE)))","v":""},null,null,null,null,null,null,null,null,{"$f":"IF($I65=\"\",\"\",IF('Offerte goederen'!$W$22=1,VLOOKUP($I65,Prijslijst!A:E,5,FALSE),VLOOKUP($I65,Prijslijst!A:E,3,FALSE)))","v":""},{"$f":"IF(I65=\"\",\"\",VLOOKUP($I65,Prijslijst!A:D,4,FALSE))","v":""},null,null,null,{"$f":"IF(S65=\"\",\"\",(1/(1+Formulierdata!$A$29))*S65)","v":""},null,{"$f":"IF('Offerte goederen'!$W$22=1,IF(L65=\"\",\"\",IF(OR(O65=\"\",O65=0,O65=1),L65,L65*O65)),IF(L65=\"\",\"\",IF(OR(O65=\"\",O65=0,O65=1),L65*(1+Formulierdata!$A$29),L65*(1+Formulierdata!$A$29)*O65)))","v":""}]
[null,null,{"$f":"IF(I66=\"\",\"\",IF(ISERROR(VLOOKUP(I66,Prijslijst!A:B,2,FALSE)),\"Itemnummer onbekend\",VLOOKUP(I66,Prijslijst!A:B,2,FALSE)))","v":""},null,null,null,null,null,null,null,null,{"$f":"IF($I66=\"\",\"\",IF('Offerte goederen'!$W$22=1,VLOOKUP($I66,Prijslijst!A:E,5,FALSE),VLOOKUP($I66,Prijslijst!A:E,3,FALSE)))","v":""},{"$f":"IF(I66=\"\",\"\",VLOOKUP($I66,Prijslijst!A:D,4,FALSE))","v":""},null,null,null,{"$f":"IF(S66=\"\",\"\",(1/(1+Formulierdata!$A$29))*S66)","v":""},null,{"$f":"IF('Offerte goederen'!$W$22=1,IF(L66=\"\",\"\",IF(OR(O66=\"\",O66=0,O66=1),L66,L66*O66)),IF(L66=\"\",\"\",IF(OR(O66=\"\",O66=0,O66=1),L66*(1+Formulierdata!$A$29),L66*(1+Formulierdata!$A$29)*O66)))","v":""}]
[null,null,{"$f":"IF(I67=\"\",\"\",IF(ISERROR(VLOOKUP(I67,Prijslijst!A:B,2,FALSE)),\"Itemnummer onbekend\",VLOOKUP(I67,Prijslijst!A:B,2,FALSE)))","v":""},null,null,null,null,null,null,null,null,{"$f":"IF($I67=\"\",\"\",IF('Offerte goederen'!$W$22=1,VLOOKUP($I67,Prijslijst!A:E,5,FALSE),VLOOKUP($I67,Prijslijst!A:E,3,FALSE)))","v":""},{"$f":"IF(I67=\"\",\"\",VLOOKUP($I67,Prijslijst!A:D,4,FALSE))","v":""},null,null,null,{"$f":"IF(S67=\"\",\"\",(1/(1+Formulierdata!$A$29))*S67)","v":""},null,{"$f":"IF('Offerte goederen'!$W$22=1,IF(L67=\"\",\"\",IF(OR(O67=\"\",O67=0,O67=1),L67,L67*O67)),IF(L67=\"\",\"\",IF(OR(O67=\"\",O67=0,O67=1),L67*(1+Formulierdata!$A$29),L67*(1+Formulierdata!$A$29)*O67)))","v":""}]
[null,null,{"$f":"IF(I68=\"\",\"\",IF(ISERROR(VLOOKUP(I68,Prijslijst!A:B,2,FALSE)),\"Itemnummer onbekend\",VLOOKUP(I68,Prijslijst!A:B,2,FALSE)))","v":""},null,null,null,null,null,null,null,null,{"$f":"IF($I68=\"\",\"\",IF('Offerte goederen'!$W$22=1,VLOOKUP($I68,Prijslijst!A:E,5,FALSE),VLOOKUP($I68,Prijslijst!A:E,3,FALSE)))","v":""},{"$f":"IF(I68=\"\",\"\",VLOOKUP($I68,Prijslijst!A:D,4,FALSE))","v":""},null,null,null,{"$f":"IF(S68=\"\",\"\",(1/(1+Formulierdata!$A$29))*S68)","v":""},null,{"$f":"IF('Offerte goederen'!$W$22=1,IF(L68=\"\",\"\",IF(OR(O68=\"\",O68=0,O68=1),L68,L68*O68)),IF(L68=\"\",\"\",IF(OR(O68=\"\",O68=0,O68=1),L68*(1+Formulierdata!$A$29),L68*(1+Formulierdata!$A$29)*O68)))","v":""}]
[null,null,{"$f":"IF(I69=\"\",\"\",IF(ISERROR(VLOOKUP(I69,Prijslijst!A:B,2,FALSE)),\"Itemnummer onbekend\",VLOOKUP(I69,Prijslijst!A:B,2,FALSE)))","v":""},null,null,null,null,null,null,null,null,{"$f":"IF($I69=\"\",\"\",IF('Offerte goederen'!$W$22=1,VLOOKUP($I69,Prijslijst!A:E,5,FALSE),VLOOKUP($I69,Prijslijst!A:E,3,FALSE)))","v":""},{"$f":"IF(I69=\"\",\"\",VLOOKUP($I69,Prijslijst!A:D,4,FALSE))","v":""},null,null,null,{"$f":"IF(S69=\"\",\"\",(1/(1+Formulierdata!$A$29))*S69)","v":""},null,{"$f":"IF('Offerte goederen'!$W$22=1,IF(L69=\"\",\"\",IF(OR(O69=\"\",O69=0,O69=1),L69,L69*O69)),IF(L69=\"\",\"\",IF(OR(O69=\"\",O69=0,O69=1),L69*(1+Formulierdata!$A$29),L69*(1+Formulierdata!$A$29)*O69)))","v":""}]
[null,null,{"$f":"IF(I70=\"\",\"\",IF(ISERROR(VLOOKUP(I70,Prijslijst!A:B,2,FALSE)),\"Itemnummer onbekend\",VLOOKUP(I70,Prijslijst!A:B,2,FALSE)))","v":""},null,null,null,null,null,null,null,null,{"$f":"IF($I70=\"\",\"\",IF('Offerte goederen'!$W$22=1,VLOOKUP($I70,Prijslijst!A:E,5,FALSE),VLOOKUP($I70,Prijslijst!A:E,3,FALSE)))","v":""},{"$f":"IF(I70=\"\",\"\",VLOOKUP($I70,Prijslijst!A:D,4,FALSE))","v":""},null,null,null,{"$f":"IF(S70=\"\",\"\",(1/(1+Formulierdata!$A$29))*S70)","v":""},null,{"$f":"IF('Offerte goederen'!$W$22=1,IF(L70=\"\",\"\",IF(OR(O70=\"\",O70=0,O70=1),L70,L70*O70)),IF(L70=\"\",\"\",IF(OR(O70=\"\",O70=0,O70=1),L70*(1+Formulierdata!$A$29),L70*(1+Formulierdata!$A$29)*O70)))","v":""}]
[null,null,{"$f":"IF(I71=\"\",\"\",IF(ISERROR(VLOOKUP(I71,Prijslijst!A:B,2,FALSE)),\"Itemnummer onbekend\",VLOOKUP(I71,Prijslijst!A:B,2,FALSE)))","v":""},null,null,null,null,null,null,null,null,{"$f":"IF($I71=\"\",\"\",IF('Offerte goederen'!$W$22=1,VLOOKUP($I71,Prijslijst!A:E,5,FALSE),VLOOKUP($I71,Prijslijst!A:E,3,FALSE)))","v":""},{"$f":"IF(I71=\"\",\"\",VLOOKUP($I71,Prijslijst!A:D,4,FALSE))","v":""},null,null,null,{"$f":"IF(S71=\"\",\"\",(1/(1+Formulierdata!$A$29))*S71)","v":""},null,{"$f":"IF('Offerte goederen'!$W$22=1,IF(L71=\"\",\"\",IF(OR(O71=\"\",O71=0,O71=1),L71,L71*O71)),IF(L71=\"\",\"\",IF(OR(O71=\"\",O71=0,O71=1),L71*(1+Formulierdata!$A$29),L71*(1+Formulierdata!$A$29)*O71)))","v":""}]
[null,null,{"$f":"IF(I72=\"\",\"\",IF(ISERROR(VLOOKUP(I72,Prijslijst!A:B,2,FALSE)),\"Itemnummer onbekend\",VLOOKUP(I72,Prijslijst!A:B,2,FALSE)))","v":""},null,null,null,null,null,null,null,null,{"$f":"IF($I72=\"\",\"\",IF('Offerte goederen'!$W$22=1,VLOOKUP($I72,Prijslijst!A:E,5,FALSE),VLOOKUP($I72,Prijslijst!A:E,3,FALSE)))","v":""},{"$f":"IF(I72=\"\",\"\",VLOOKUP($I72,Prijslijst!A:D,4,FALSE))","v":""},null,null,null,{"$f":"IF(S72=\"\",\"\",(1/(1+Formulierdata!$A$29))*S72)","v":""},null,{"$f":"IF('Offerte goederen'!$W$22=1,IF(L72=\"\",\"\",IF(OR(O72=\"\",O72=0,O72=1),L72,L72*O72)),IF(L72=\"\",\"\",IF(OR(O72=\"\",O72=0,O72=1),L72*(1+Formulierdata!$A$29),L72*(1+Formulierdata!$A$29)*O72)))","v":""}]
[null,null,{"$f":"IF(I73=\"\",\"\",IF(ISERROR(VLOOKUP(I73,Prijslijst!A:B,2,FALSE)),\"Itemnummer onbekend\",VLOOKUP(I73,Prijslijst!A:B,2,FALSE)))","v":""},null,null,null,null,null,null,null,null,{"$f":"IF($I73=\"\",\"\",IF('Offerte goederen'!$W$22=1,VLOOKUP($I73,Prijslijst!A:E,5,FALSE),VLOOKUP($I73,Prijslijst!A:E,3,FALSE)))","v":""},{"$f":"IF(I73=\"\",\"\",VLOOKUP($I73,Prijslijst!A:D,4,FALSE))","v":""},null,null,null,{"$f":"IF(S73=\"\",\"\",(1/(1+Formulierdata!$A$29))*S73)","v":""},null,{"$f":"IF('Offerte goederen'!$W$22=1,IF(L73=\"\",\"\",IF(OR(O73=\"\",O73=0,O73=1),L73,L73*O73)),IF(L73=\"\",\"\",IF(OR(O73=\"\",O73=0,O73=1),L73*(1+Formulierdata!$A$29),L73*(1+Formulierdata!$A$29)*O73)))","v":""}]
[null,null,{"$f":"IF(I74=\"\",\"\",IF(ISERROR(VLOOKUP(I74,Prijslijst!A:B,2,FALSE)),\"Itemnummer onbekend\",VLOOKUP(I74,Prijslijst!A:B,2,FALSE)))","v":""},null,null,null,null,null,null,null,null,{"$f":"IF($I74=\"\",\"\",IF('Offerte goederen'!$W$22=1,VLOOKUP($I74,Prijslijst!A:E,5,FALSE),VLOOKUP($I74,Prijslijst!A:E,3,FALSE)))","v":""},{"$f":"IF(I74=\"\",\"\",VLOOKUP($I74,Prijslijst!A:D,4,FALSE))","v":""},null,null,null,{"$f":"IF(S74=\"\",\"\",(1/(1+Formulierdata!$A$29))*S74)","v":""},null,{"$f":"IF('Offerte goederen'!$W$22=1,IF(L74=\"\",\"\",IF(OR(O74=\"\",O74=0,O74=1),L74,L74*O74)),IF(L74=\"\",\"\",IF(OR(O74=\"\",O74=0,O74=1),L74*(1+Formulierdata!$A$29),L74*(1+Formulierdata!$A$29)*O74)))","v":""}]
[null,null,{"$f":"IF(I75=\"\",\"\",IF(ISERROR(VLOOKUP(I75,Prijslijst!A:B,2,FALSE)),\"Itemnummer onbekend\",VLOOKUP(I75,Prijslijst!A:B,2,FALSE)))","v":""},null,null,null,null,null,null,null,null,{"$f":"IF($I75=\"\",\"\",IF('Offerte goederen'!$W$22=1,VLOOKUP($I75,Prijslijst!A:E,5,FALSE),VLOOKUP($I75,Prijslijst!A:E,3,FALSE)))","v":""},{"$f":"IF(I75=\"\",\"\",VLOOKUP($I75,Prijslijst!A:D,4,FALSE))","v":""},null,null,null,{"$f":"IF(S75=\"\",\"\",(1/(1+Formulierdata!$A$29))*S75)","v":""},null,{"$f":"IF('Offerte goederen'!$W$22=1,IF(L75=\"\",\"\",IF(OR(O75=\"\",O75=0,O75=1),L75,L75*O75)),IF(L75=\"\",\"\",IF(OR(O75=\"\",O75=0,O75=1),L75*(1+Formulierdata!$A$29),L75*(1+Formulierdata!$A$29)*O75)))","v":""}]
[null,null,{"$f":"IF(I76=\"\",\"\",IF(ISERROR(VLOOKUP(I76,Prijslijst!A:B,2,FALSE)),\"Itemnummer onbekend\",VLOOKUP(I76,Prijslijst!A:B,2,FALSE)))","v":""},null,null,null,null,null,null,null,null,{"$f":"IF($I76=\"\",\"\",IF('Offerte goederen'!$W$22=1,VLOOKUP($I76,Prijslijst!A:E,5,FALSE),VLOOKUP($I76,Prijslijst!A:E,3,FALSE)))","v":""},{"$f":"IF(I76=\"\",\"\",VLOOKUP($I76,Prijslijst!A:D,4,FALSE))","v":""},null,null,null,{"$f":"IF(S76=\"\",\"\",(1/(1+Formulierdata!$A$29))*S76)","v":""},null,{"$f":"IF('Offerte goederen'!$W$22=1,IF(L76=\"\",\"\",IF(OR(O76=\"\",O76=0,O76=1),L76,L76*O76)),IF(L76=\"\",\"\",IF(OR(O76=\"\",O76=0,O76=1),L76*(1+Formulierdata!$A$29),L76*(1+Formulierdata!$A$29)*O76)))","v":""}]
[null,null,{"$f":"IF(I77=\"\",\"\",IF(ISERROR(VLOOKUP(I77,Prijslijst!A:B,2,FALSE)),\"Itemnummer onbekend\",VLOOKUP(I77,Prijslijst!A:B,2,FALSE)))","v":""},null,null,null,null,null,null,null,null,{"$f":"IF($I77=\"\",\"\",IF('Offerte goederen'!$W$22=1,VLOOKUP($I77,Prijslijst!A:E,5,FALSE),VLOOKUP($I77,Prijslijst!A:E,3,FALSE)))","v":""},{"$f":"IF(I77=\"\",\"\",VLOOKUP($I77,Prijslijst!A:D,4,FALSE))","v":""},null,null,null,{"$f":"IF(S77=\"\",\"\",(1/(1+Formulierdata!$A$29))*S77)","v":""},null,{"$f":"IF('Offerte goederen'!$W$22=1,IF(L77=\"\",\"\",IF(OR(O77=\"\",O77=0,O77=1),L77,L77*O77)),IF(L77=\"\",\"\",IF(OR(O77=\"\",O77=0,O77=1),L77*(1+Formulierdata!$A$29),L77*(1+Formulierdata!$A$29)*O77)))","v":""}]
[null,null,{"$f":"IF(I78=\"\",\"\",IF(ISERROR(VLOOKUP(I78,Prijslijst!A:B,2,FALSE)),\"Itemnummer onbekend\",VLOOKUP(I78,Prijslijst!A:B,2,FALSE)))","v":""},null,null,null,null,null,null,null,null,{"$f":"IF($I78=\"\",\"\",IF('Offerte goederen'!$W$22=1,VLOOKUP($I78,Prijslijst!A:E,5,FALSE),VLOOKUP($I78,Prijslijst!A:E,3,FALSE)))","v":""},{"$f":"IF(I78=\"\",\"\",VLOOKUP($I78,Prijslijst!A:D,4,FALSE))","v":""},null,null,null,{"$f":"IF(S78=\"\",\"\",(1/(1+Formulierdata!$A$29))*S78)","v":""},null,{"$f":"IF('Offerte goederen'!$W$22=1,IF(L78=\"\",\"\",IF(OR(O78=\"\",O78=0,O78=1),L78,L78*O78)),IF(L78=\"\",\"\",IF(OR(O78=\"\",O78=0,O78=1),L78*(1+Formulierdata!$A$29),L78*(1+Formulierdata!$A$29)*O78)))","v":""}]
[null,null,{"$f":"IF(I79=\"\",\"\",IF(ISERROR(VLOOKUP(I79,Prijslijst!A:B,2,FALSE)),\"Itemnummer onbekend\",VLOOKUP(I79,Prijslijst!A:B,2,FALSE)))","v":""},null,null,null,null,null,null,null,null,{"$f":"IF($I79=\"\",\"\",IF('Offerte goederen'!$W$22=1,VLOOKUP($I79,Prijslijst!A:E,5,FALSE),VLOOKUP($I79,Prijslijst!A:E,3,FALSE)))","v":""},{"$f":"IF(I79=\"\",\"\",VLOOKUP($I79,Prijslijst!A:D,4,FALSE))","v":""},null,null,null,{"$f":"IF(S79=\"\",\"\",(1/(1+Formulierdata!$A$29))*S79)","v":""},null,{"$f":"IF('Offerte goederen'!$W$22=1,IF(L79=\"\",\"\",IF(OR(O79=\"\",O79=0,O79=1),L79,L79*O79)),IF(L79=\"\",\"\",IF(OR(O79=\"\",O79=0,O79=1),L79*(1+Formulierdata!$A$29),L79*(1+Formulierdata!$A$29)*O79)))","v":""}]
[null,null,{"$f":"IF(I80=\"\",\"\",IF(ISERROR(VLOOKUP(I80,Prijslijst!A:B,2,FALSE)),\"Itemnummer onbekend\",VLOOKUP(I80,Prijslijst!A:B,2,FALSE)))","v":""},null,null,null,null,null,null,null,null,{"$f":"IF($I80=\"\",\"\",IF('Offerte goederen'!$W$22=1,VLOOKUP($I80,Prijslijst!A:E,5,FALSE),VLOOKUP($I80,Prijslijst!A:E,3,FALSE)))","v":""},{"$f":"IF(I80=\"\",\"\",VLOOKUP($I80,Prijslijst!A:D,4,FALSE))","v":""},null,null,null,{"$f":"IF(S80=\"\",\"\",(1/(1+Formulierdata!$A$29))*S80)","v":""},null,{"$f":"IF('Offerte goederen'!$W$22=1,IF(L80=\"\",\"\",IF(OR(O80=\"\",O80=0,O80=1),L80,L80*O80)),IF(L80=\"\",\"\",IF(OR(O80=\"\",O80=0,O80=1),L80*(1+Formulierdata!$A$29),L80*(1+Formulierdata!$A$29)*O80)))","v":""}]
[null,null,{"$f":"IF(I81=\"\",\"\",IF(ISERROR(VLOOKUP(I81,Prijslijst!A:B,2,FALSE)),\"Itemnummer onbekend\",VLOOKUP(I81,Prijslijst!A:B,2,FALSE)))","v":""},null,null,null,null,null,null,null,null,{"$f":"IF($I81=\"\",\"\",IF('Offerte goederen'!$W$22=1,VLOOKUP($I81,Prijslijst!A:E,5,FALSE),VLOOKUP($I81,Prijslijst!A:E,3,FALSE)))","v":""},{"$f":"IF(I81=\"\",\"\",VLOOKUP($I81,Prijslijst!A:D,4,FALSE))","v":""},null,null,null,{"$f":"IF(S81=\"\",\"\",(1/(1+Formulierdata!$A$29))*S81)","v":""},null,{"$f":"IF('Offerte goederen'!$W$22=1,IF(L81=\"\",\"\",IF(OR(O81=\"\",O81=0,O81=1),L81,L81*O81)),IF(L81=\"\",\"\",IF(OR(O81=\"\",O81=0,O81=1),L81*(1+Formulierdata!$A$29),L81*(1+Formulierdata!$A$29)*O81)))","v":""}]
[null,null,{"$f":"IF(I82=\"\",\"\",IF(ISERROR(VLOOKUP(I82,Prijslijst!A:B,2,FALSE)),\"Itemnummer onbekend\",VLOOKUP(I82,Prijslijst!A:B,2,FALSE)))","v":""},null,null,null,null,null,null,null,null,{"$f":"IF($I82=\"\",\"\",IF('Offerte goederen'!$W$22=1,VLOOKUP($I82,Prijslijst!A:E,5,FALSE),VLOOKUP($I82,Prijslijst!A:E,3,FALSE)))","v":""},{"$f":"IF(I82=\"\",\"\",VLOOKUP($I82,Prijslijst!A:D,4,FALSE))","v":""},null,null,null,{"$f":"IF(S82=\"\",\"\",(1/(1+Formulierdata!$A$29))*S82)","v":""},null,{"$f":"IF('Offerte goederen'!$W$22=1,IF(L82=\"\",\"\",IF(OR(O82=\"\",O82=0,O82=1),L82,L82*O82)),IF(L82=\"\",\"\",IF(OR(O82=\"\",O82=0,O82=1),L82*(1+Formulierdata!$A$29),L82*(1+Formulierdata!$A$29)*O82)))","v":""}]
[null,null,{"$f":"IF(I83=\"\",\"\",IF(ISERROR(VLOOKUP(I83,Prijslijst!A:B,2,FALSE)),\"Itemnummer onbekend\",VLOOKUP(I83,Prijslijst!A:B,2,FALSE)))","v":""},null,null,null,null,null,null,null,null,{"$f":"IF($I83=\"\",\"\",IF('Offerte goederen'!$W$22=1,VLOOKUP($I83,Prijslijst!A:E,5,FALSE),VLOOKUP($I83,Prijslijst!A:E,3,FALSE)))","v":""},{"$f":"IF(I83=\"\",\"\",VLOOKUP($I83,Prijslijst!A:D,4,FALSE))","v":""},null,null,null,{"$f":"IF(S83=\"\",\"\",(1/(1+Formulierdata!$A$29))*S83)","v":""},null,{"$f":"IF('Offerte goederen'!$W$22=1,IF(L83=\"\",\"\",IF(OR(O83=\"\",O83=0,O83=1),L83,L83*O83)),IF(L83=\"\",\"\",IF(OR(O83=\"\",O83=0,O83=1),L83*(1+Formulierdata!$A$29),L83*(1+Formulierdata!$A$29)*O83)))","v":""}]
[null,null,{"$f":"IF(I84=\"\",\"\",IF(ISERROR(VLOOKUP(I84,Prijslijst!A:B,2,FALSE)),\"Itemnummer onbekend\",VLOOKUP(I84,Prijslijst!A:B,2,FALSE)))","v":""},null,null,null,null,null,null,null,null,{"$f":"IF($I84=\"\",\"\",IF('Offerte goederen'!$W$22=1,VLOOKUP($I84,Prijslijst!A:E,5,FALSE),VLOOKUP($I84,Prijslijst!A:E,3,FALSE)))","v":""},{"$f":"IF(I84=\"\",\"\",VLOOKUP($I84,Prijslijst!A:D,4,FALSE))","v":""},null,null,null,{"$f":"IF(S84=\"\",\"\",(1/(1+Formulierdata!$A$29))*S84)","v":""},null,{"$f":"IF('Offerte goederen'!$W$22=1,IF(L84=\"\",\"\",IF(OR(O84=\"\",O84=0,O84=1),L84,L84*O84)),IF(L84=\"\",\"\",IF(OR(O84=\"\",O84=0,O84=1),L84*(1+Formulierdata!$A$29),L84*(1+Formulierdata!$A$29)*O84)))","v":""}]
[null,null,{"$f":"IF(I85=\"\",\"\",IF(ISERROR(VLOOKUP(I85,Prijslijst!A:B,2,FALSE)),\"Itemnummer onbekend\",VLOOKUP(I85,Prijslijst!A:B,2,FALSE)))","v":""},null,null,null,null,null,null,null,null,{"$f":"IF($I85=\"\",\"\",IF('Offerte goederen'!$W$22=1,VLOOKUP($I85,Prijslijst!A:E,5,FALSE),VLOOKUP($I85,Prijslijst!A:E,3,FALSE)))","v":""},{"$f":"IF(I85=\"\",\"\",VLOOKUP($I85,Prijslijst!A:D,4,FALSE))","v":""},null,null,null,{"$f":"IF(S85=\"\",\"\",(1/(1+Formulierdata!$A$29))*S85)","v":""},null,{"$f":"IF('Offerte goederen'!$W$22=1,IF(L85=\"\",\"\",IF(OR(O85=\"\",O85=0,O85=1),L85,L85*O85)),IF(L85=\"\",\"\",IF(OR(O85=\"\",O85=0,O85=1),L85*(1+Formulierdata!$A$29),L85*(1+Formulierdata!$A$29)*O85)))","v":""}]
[null,null,{"$f":"IF(I86=\"\",\"\",IF(ISERROR(VLOOKUP(I86,Prijslijst!A:B,2,FALSE)),\"Itemnummer onbekend\",VLOOKUP(I86,Prijslijst!A:B,2,FALSE)))","v":""},null,null,null,null,null,null,null,null,{"$f":"IF($I86=\"\",\"\",IF('Offerte goederen'!$W$22=1,VLOOKUP($I86,Prijslijst!A:E,5,FALSE),VLOOKUP($I86,Prijslijst!A:E,3,FALSE)))","v":""},{"$f":"IF(I86=\"\",\"\",VLOOKUP($I86,Prijslijst!A:D,4,FALSE))","v":""},null,null,null,{"$f":"IF(S86=\"\",\"\",(1/(1+Formulierdata!$A$29))*S86)","v":""},null,{"$f":"IF('Offerte goederen'!$W$22=1,IF(L86=\"\",\"\",IF(OR(O86=\"\",O86=0,O86=1),L86,L86*O86)),IF(L86=\"\",\"\",IF(OR(O86=\"\",O86=0,O86=1),L86*(1+Formulierdata!$A$29),L86*(1+Formulierdata!$A$29)*O86)))","v":""}]
[null,null,{"$f":"IF(I87=\"\",\"\",IF(ISERROR(VLOOKUP(I87,Prijslijst!A:B,2,FALSE)),\"Itemnummer onbekend\",VLOOKUP(I87,Prijslijst!A:B,2,FALSE)))","v":""},null,null,null,null,null,null,null,null,{"$f":"IF($I87=\"\",\"\",IF('Offerte goederen'!$W$22=1,VLOOKUP($I87,Prijslijst!A:E,5,FALSE),VLOOKUP($I87,Prijslijst!A:E,3,FALSE)))","v":""},{"$f":"IF(I87=\"\",\"\",VLOOKUP($I87,Prijslijst!A:D,4,FALSE))","v":""},null,null,null,{"$f":"IF(S87=\"\",\"\",(1/(1+Formulierdata!$A$29))*S87)","v":""},null,{"$f":"IF('Offerte goederen'!$W$22=1,IF(L87=\"\",\"\",IF(OR(O87=\"\",O87=0,O87=1),L87,L87*O87)),IF(L87=\"\",\"\",IF(OR(O87=\"\",O87=0,O87=1),L87*(1+Formulierdata!$A$29),L87*(1+Formulierdata!$A$29)*O87)))","v":""}]
[null,null,{"$f":"IF(I88=\"\",\"\",IF(ISERROR(VLOOKUP(I88,Prijslijst!A:B,2,FALSE)),\"Itemnummer onbekend\",VLOOKUP(I88,Prijslijst!A:B,2,FALSE)))","v":""},null,null,null,null,null,null,null,null,{"$f":"IF($I88=\"\",\"\",IF('Offerte goederen'!$W$22=1,VLOOKUP($I88,Prijslijst!A:E,5,FALSE),VLOOKUP($I88,Prijslijst!A:E,3,FALSE)))","v":""},{"$f":"IF(I88=\"\",\"\",VLOOKUP($I88,Prijslijst!A:D,4,FALSE))","v":""},null,null,null,{"$f":"IF(S88=\"\",\"\",(1/(1+Formulierdata!$A$29))*S88)","v":""},null,{"$f":"IF('Offerte goederen'!$W$22=1,IF(L88=\"\",\"\",IF(OR(O88=\"\",O88=0,O88=1),L88,L88*O88)),IF(L88=\"\",\"\",IF(OR(O88=\"\",O88=0,O88=1),L88*(1+Formulierdata!$A$29),L88*(1+Formulierdata!$A$29)*O88)))","v":""}]
[null,null,{"$f":"IF(I89=\"\",\"\",IF(ISERROR(VLOOKUP(I89,Prijslijst!A:B,2,FALSE)),\"Itemnummer onbekend\",VLOOKUP(I89,Prijslijst!A:B,2,FALSE)))","v":""},null,null,null,null,null,null,null,null,{"$f":"IF($I89=\"\",\"\",IF('Offerte goederen'!$W$22=1,VLOOKUP($I89,Prijslijst!A:E,5,FALSE),VLOOKUP($I89,Prijslijst!A:E,3,FALSE)))","v":""},{"$f":"IF(I89=\"\",\"\",VLOOKUP($I89,Prijslijst!A:D,4,FALSE))","v":""},null,null,null,{"$f":"IF(S89=\"\",\"\",(1/(1+Formulierdata!$A$29))*S89)","v":""},null,{"$f":"IF('Offerte goederen'!$W$22=1,IF(L89=\"\",\"\",IF(OR(O89=\"\",O89=0,O89=1),L89,L89*O89)),IF(L89=\"\",\"\",IF(OR(O89=\"\",O89=0,O89=1),L89*(1+Formulierdata!$A$29),L89*(1+Formulierdata!$A$29)*O89)))","v":""}]
[null,null,{"$f":"IF(I90=\"\",\"\",IF(ISERROR(VLOOKUP(I90,Prijslijst!A:B,2,FALSE)),\"Itemnummer onbekend\",VLOOKUP(I90,Prijslijst!A:B,2,FALSE)))","v":""},null,null,null,null,null,null,null,null,{"$f":"IF($I90=\"\",\"\",IF('Offerte goederen'!$W$22=1,VLOOKUP($I90,Prijslijst!A:E,5,FALSE),VLOOKUP($I90,Prijslijst!A:E,3,FALSE)))","v":""},{"$f":"IF(I90=\"\",\"\",VLOOKUP($I90,Prijslijst!A:D,4,FALSE))","v":""},null,null,null,{"$f":"IF(S90=\"\",\"\",(1/(1+Formulierdata!$A$29))*S90)","v":""},null,{"$f":"IF('Offerte goederen'!$W$22=1,IF(L90=\"\",\"\",IF(OR(O90=\"\",O90=0,O90=1),L90,L90*O90)),IF(L90=\"\",\"\",IF(OR(O90=\"\",O90=0,O90=1),L90*(1+Formulierdata!$A$29),L90*(1+Formulierdata!$A$29)*O90)))","v":""}]
[null,null,{"$f":"IF(I91=\"\",\"\",IF(ISERROR(VLOOKUP(I91,Prijslijst!A:B,2,FALSE)),\"Itemnummer onbekend\",VLOOKUP(I91,Prijslijst!A:B,2,FALSE)))","v":""},null,null,null,null,null,null,null,null,{"$f":"IF($I91=\"\",\"\",IF('Offerte goederen'!$W$22=1,VLOOKUP($I91,Prijslijst!A:E,5,FALSE),VLOOKUP($I91,Prijslijst!A:E,3,FALSE)))","v":""},{"$f":"IF(I91=\"\",\"\",VLOOKUP($I91,Prijslijst!A:D,4,FALSE))","v":""},null,null,null,{"$f":"IF(S91=\"\",\"\",(1/(1+Formulierdata!$A$29))*S91)","v":""},null,{"$f":"IF('Offerte goederen'!$W$22=1,IF(L91=\"\",\"\",IF(OR(O91=\"\",O91=0,O91=1),L91,L91*O91)),IF(L91=\"\",\"\",IF(OR(O91=\"\",O91=0,O91=1),L91*(1+Formulierdata!$A$29),L91*(1+Formulierdata!$A$29)*O91)))","v":""}]
[null,null,{"$f":"IF(I92=\"\",\"\",IF(ISERROR(VLOOKUP(I92,Prijslijst!A:B,2,FALSE)),\"Itemnummer onbekend\",VLOOKUP(I92,Prijslijst!A:B,2,FALSE)))","v":""},null,null,null,null,null,null,null,null,{"$f":"IF($I92=\"\",\"\",IF('Offerte goederen'!$W$22=1,VLOOKUP($I92,Prijslijst!A:E,5,FALSE),VLOOKUP($I92,Prijslijst!A:E,3,FALSE)))","v":""},{"$f":"IF(I92=\"\",\"\",VLOOKUP($I92,Prijslijst!A:D,4,FALSE))","v":""},null,null,null,{"$f":"IF(S92=\"\",\"\",(1/(1+Formulierdata!$A$29))*S92)","v":""},null,{"$f":"IF('Offerte goederen'!$W$22=1,IF(L92=\"\",\"\",IF(OR(O92=\"\",O92=0,O92=1),L92,L92*O92)),IF(L92=\"\",\"\",IF(OR(O92=\"\",O92=0,O92=1),L92*(1+Formulierdata!$A$29),L92*(1+Formulierdata!$A$29)*O92)))","v":""}]
[null,null,{"$f":"IF(I93=\"\",\"\",IF(ISERROR(VLOOKUP(I93,Prijslijst!A:B,2,FALSE)),\"Itemnummer onbekend\",VLOOKUP(I93,Prijslijst!A:B,2,FALSE)))","v":""},null,null,null,null,null,null,null,null,{"$f":"IF($I93=\"\",\"\",IF('Offerte goederen'!$W$22=1,VLOOKUP($I93,Prijslijst!A:E,5,FALSE),VLOOKUP($I93,Prijslijst!A:E,3,FALSE)))","v":""},{"$f":"IF(I93=\"\",\"\",VLOOKUP($I93,Prijslijst!A:D,4,FALSE))","v":""},null,null,null,{"$f":"IF(S93=\"\",\"\",(1/(1+Formulierdata!$A$29))*S93)","v":""},null,{"$f":"IF('Offerte goederen'!$W$22=1,IF(L93=\"\",\"\",IF(OR(O93=\"\",O93=0,O93=1),L93,L93*O93)),IF(L93=\"\",\"\",IF(OR(O93=\"\",O93=0,O93=1),L93*(1+Formulierdata!$A$29),L93*(1+Formulierdata!$A$29)*O93)))","v":""}]
[null,null,{"$f":"IF(I94=\"\",\"\",IF(ISERROR(VLOOKUP(I94,Prijslijst!A:B,2,FALSE)),\"Itemnummer onbekend\",VLOOKUP(I94,Prijslijst!A:B,2,FALSE)))","v":""},null,null,null,null,null,null,null,null,{"$f":"IF($I94=\"\",\"\",IF('Offerte goederen'!$W$22=1,VLOOKUP($I94,Prijslijst!A:E,5,FALSE),VLOOKUP($I94,Prijslijst!A:E,3,FALSE)))","v":""},{"$f":"IF(I94=\"\",\"\",VLOOKUP($I94,Prijslijst!A:D,4,FALSE))","v":""},null,null,null,{"$f":"IF(S94=\"\",\"\",(1/(1+Formulierdata!$A$29))*S94)","v":""},null,{"$f":"IF('Offerte goederen'!$W$22=1,IF(L94=\"\",\"\",IF(OR(O94=\"\",O94=0,O94=1),L94,L94*O94)),IF(L94=\"\",\"\",IF(OR(O94=\"\",O94=0,O94=1),L94*(1+Formulierdata!$A$29),L94*(1+Formulierdata!$A$29)*O94)))","v":""}]
[null,null,{"$f":"IF(I95=\"\",\"\",IF(ISERROR(VLOOKUP(I95,Prijslijst!A:B,2,FALSE)),\"Itemnummer onbekend\",VLOOKUP(I95,Prijslijst!A:B,2,FALSE)))","v":""},null,null,null,null,null,null,null,null,{"$f":"IF($I95=\"\",\"\",IF('Offerte goederen'!$W$22=1,VLOOKUP($I95,Prijslijst!A:E,5,FALSE),VLOOKUP($I95,Prijslijst!A:E,3,FALSE)))","v":""},{"$f":"IF(I95=\"\",\"\",VLOOKUP($I95,Prijslijst!A:D,4,FALSE))","v":""},null,null,null,{"$f":"IF(S95=\"\",\"\",(1/(1+Formulierdata!$A$29))*S95)","v":""},null,{"$f":"IF('Offerte goederen'!$W$22=1,IF(L95=\"\",\"\",IF(OR(O95=\"\",O95=0,O95=1),L95,L95*O95)),IF(L95=\"\",\"\",IF(OR(O95=\"\",O95=0,O95=1),L95*(1+Formulierdata!$A$29),L95*(1+Formulierdata!$A$29)*O95)))","v":""}]
[null,null,{"$f":"IF(I96=\"\",\"\",IF(ISERROR(VLOOKUP(I96,Prijslijst!A:B,2,FALSE)),\"Itemnummer onbekend\",VLOOKUP(I96,Prijslijst!A:B,2,FALSE)))","v":""},null,null,null,null,null,null,null,null,{"$f":"IF($I96=\"\",\"\",IF('Offerte goederen'!$W$22=1,VLOOKUP($I96,Prijslijst!A:E,5,FALSE),VLOOKUP($I96,Prijslijst!A:E,3,FALSE)))","v":""},{"$f":"IF(I96=\"\",\"\",VLOOKUP($I96,Prijslijst!A:D,4,FALSE))","v":""},null,null,null,{"$f":"IF(S96=\"\",\"\",(1/(1+Formulierdata!$A$29))*S96)","v":""},null,{"$f":"IF('Offerte goederen'!$W$22=1,IF(L96=\"\",\"\",IF(OR(O96=\"\",O96=0,O96=1),L96,L96*O96)),IF(L96=\"\",\"\",IF(OR(O96=\"\",O96=0,O96=1),L96*(1+Formulierdata!$A$29),L96*(1+Formulierdata!$A$29)*O96)))","v":""}]
[null,null,{"$f":"IF(I97=\"\",\"\",IF(ISERROR(VLOOKUP(I97,Prijslijst!A:B,2,FALSE)),\"Itemnummer onbekend\",VLOOKUP(I97,Prijslijst!A:B,2,FALSE)))","v":""},null,null,null,null,null,null,null,null,{"$f":"IF($I97=\"\",\"\",IF('Offerte goederen'!$W$22=1,VLOOKUP($I97,Prijslijst!A:E,5,FALSE),VLOOKUP($I97,Prijslijst!A:E,3,FALSE)))","v":""},{"$f":"IF(I97=\"\",\"\",VLOOKUP($I97,Prijslijst!A:D,4,FALSE))","v":""},null,null,null,{"$f":"IF(S97=\"\",\"\",(1/(1+Formulierdata!$A$29))*S97)","v":""},null,{"$f":"IF('Offerte goederen'!$W$22=1,IF(L97=\"\",\"\",IF(OR(O97=\"\",O97=0,O97=1),L97,L97*O97)),IF(L97=\"\",\"\",IF(OR(O97=\"\",O97=0,O97=1),L97*(1+Formulierdata!$A$29),L97*(1+Formulierdata!$A$29)*O97)))","v":""}]
[null,null,{"$f":"IF(I98=\"\",\"\",IF(ISERROR(VLOOKUP(I98,Prijslijst!A:B,2,FALSE)),\"Itemnummer onbekend\",VLOOKUP(I98,Prijslijst!A:B,2,FALSE)))","v":""},null,null,null,null,null,null,null,null,{"$f":"IF($I98=\"\",\"\",IF('Offerte goederen'!$W$22=1,VLOOKUP($I98,Prijslijst!A:E,5,FALSE),VLOOKUP($I98,Prijslijst!A:E,3,FALSE)))","v":""},{"$f":"IF(I98=\"\",\"\",VLOOKUP($I98,Prijslijst!A:D,4,FALSE))","v":""},null,null,null,{"$f":"IF(S98=\"\",\"\",(1/(1+Formulierdata!$A$29))*S98)","v":""},null,{"$f":"IF('Offerte goederen'!$W$22=1,IF(L98=\"\",\"\",IF(OR(O98=\"\",O98=0,O98=1),L98,L98*O98)),IF(L98=\"\",\"\",IF(OR(O98=\"\",O98=0,O98=1),L98*(1+Formulierdata!$A$29),L98*(1+Formulierdata!$A$29)*O98)))","v":""}]
[null,null,{"$f":"IF(I99=\"\",\"\",IF(ISERROR(VLOOKUP(I99,Prijslijst!A:B,2,FALSE)),\"Itemnummer onbekend\",VLOOKUP(I99,Prijslijst!A:B,2,FALSE)))","v":""},null,null,null,null,null,null,null,null,{"$f":"IF($I99=\"\",\"\",IF('Offerte goederen'!$W$22=1,VLOOKUP($I99,Prijslijst!A:E,5,FALSE),VLOOKUP($I99,Prijslijst!A:E,3,FALSE)))","v":""},{"$f":"IF(I99=\"\",\"\",VLOOKUP($I99,Prijslijst!A:D,4,FALSE))","v":""},null,null,null,{"$f":"IF(S99=\"\",\"\",(1/(1+Formulierdata!$A$29))*S99)","v":""},null,{"$f":"IF('Offerte goederen'!$W$22=1,IF(L99=\"\",\"\",IF(OR(O99=\"\",O99=0,O99=1),L99,L99*O99)),IF(L99=\"\",\"\",IF(OR(O99=\"\",O99=0,O99=1),L99*(1+Formulierdata!$A$29),L99*(1+Formulierdata!$A$29)*O99)))","v":""}]
[null,null,{"$f":"IF(I100=\"\",\"\",IF(ISERROR(VLOOKUP(I100,Prijslijst!A:B,2,FALSE)),\"Itemnummer onbekend\",VLOOKUP(I100,Prijslijst!A:B,2,FALSE)))","v":""},null,null,null,null,null,null,null,null,{"$f":"IF($I100=\"\",\"\",IF('Offerte goederen'!$W$22=1,VLOOKUP($I100,Prijslijst!A:E,5,FALSE),VLOOKUP($I100,Prijslijst!A:E,3,FALSE)))","v":""},{"$f":"IF(I100=\"\",\"\",VLOOKUP($I100,Prijslijst!A:D,4,FALSE))","v":""},null,null,null,{"$f":"IF(S100=\"\",\"\",(1/(1+Formulierdata!$A$29))*S100)","v":""},null,{"$f":"IF('Offerte goederen'!$W$22=1,IF(L100=\"\",\"\",IF(OR(O100=\"\",O100=0,O100=1),L100,L100*O100)),IF(L100=\"\",\"\",IF(OR(O100=\"\",O100=0,O100=1),L100*(1+Formulierdata!$A$29),L100*(1+Formulierdata!$A$29)*O100)))","v":""}]
[null,null,{"$f":"IF(I101=\"\",\"\",IF(ISERROR(VLOOKUP(I101,Prijslijst!A:B,2,FALSE)),\"Itemnummer onbekend\",VLOOKUP(I101,Prijslijst!A:B,2,FALSE)))","v":""},null,null,null,null,null,null,null,null,{"$f":"IF($I101=\"\",\"\",IF('Offerte goederen'!$W$22=1,VLOOKUP($I101,Prijslijst!A:E,5,FALSE),VLOOKUP($I101,Prijslijst!A:E,3,FALSE)))","v":""},{"$f":"IF(I101=\"\",\"\",VLOOKUP($I101,Prijslijst!A:D,4,FALSE))","v":""},null,null,null,{"$f":"IF(S101=\"\",\"\",(1/(1+Formulierdata!$A$29))*S101)","v":""},null,{"$f":"IF('Offerte goederen'!$W$22=1,IF(L101=\"\",\"\",IF(OR(O101=\"\",O101=0,O101=1),L101,L101*O101)),IF(L101=\"\",\"\",IF(OR(O101=\"\",O101=0,O101=1),L101*(1+Formulierdata!$A$29),L101*(1+Formulierdata!$A$29)*O101)))","v":""}]
[null,null,{"$f":"IF(I102=\"\",\"\",IF(ISERROR(VLOOKUP(I102,Prijslijst!A:B,2,FALSE)),\"Itemnummer onbekend\",VLOOKUP(I102,Prijslijst!A:B,2,FALSE)))","v":""},null,null,null,null,null,null,null,null,{"$f":"IF($I102=\"\",\"\",IF('Offerte goederen'!$W$22=1,VLOOKUP($I102,Prijslijst!A:E,5,FALSE),VLOOKUP($I102,Prijslijst!A:E,3,FALSE)))","v":""},{"$f":"IF(I102=\"\",\"\",VLOOKUP($I102,Prijslijst!A:D,4,FALSE))","v":""},null,null,null,{"$f":"IF(S102=\"\",\"\",(1/(1+Formulierdata!$A$29))*S102)","v":""},null,{"$f":"IF('Offerte goederen'!$W$22=1,IF(L102=\"\",\"\",IF(OR(O102=\"\",O102=0,O102=1),L102,L102*O102)),IF(L102=\"\",\"\",IF(OR(O102=\"\",O102=0,O102=1),L102*(1+Formulierdata!$A$29),L102*(1+Formulierdata!$A$29)*O102)))","v":""}]
[null,null,{"$f":"IF(I103=\"\",\"\",IF(ISERROR(VLOOKUP(I103,Prijslijst!A:B,2,FALSE)),\"Itemnummer onbekend\",VLOOKUP(I103,Prijslijst!A:B,2,FALSE)))","v":""},null,null,null,null,null,null,null,null,{"$f":"IF($I103=\"\",\"\",IF('Offerte goederen'!$W$22=1,VLOOKUP($I103,Prijslijst!A:E,5,FALSE),VLOOKUP($I103,Prijslijst!A:E,3,FALSE)))","v":""},{"$f":"IF(I103=\"\",\"\",VLOOKUP($I103,Prijslijst!A:D,4,FALSE))","v":""},null,null,null,{"$f":"IF(S103=\"\",\"\",(1/(1+Formulierdata!$A$29))*S103)","v":""},null,{"$f":"IF('Offerte goederen'!$W$22=1,IF(L103=\"\",\"\",IF(OR(O103=\"\",O103=0,O103=1),L103,L103*O103)),IF(L103=\"\",\"\",IF(OR(O103=\"\",O103=0,O103=1),L103*(1+Formulierdata!$A$29),L103*(1+Formulierdata!$A$29)*O103)))","v":""}]
[null,null,{"$f":"IF(I104=\"\",\"\",IF(ISERROR(VLOOKUP(I104,Prijslijst!A:B,2,FALSE)),\"Itemnummer onbekend\",VLOOKUP(I104,Prijslijst!A:B,2,FALSE)))","v":""},null,null,null,null,null,null,null,null,{"$f":"IF($I104=\"\",\"\",IF('Offerte goederen'!$W$22=1,VLOOKUP($I104,Prijslijst!A:E,5,FALSE),VLOOKUP($I104,Prijslijst!A:E,3,FALSE)))","v":""},{"$f":"IF(I104=\"\",\"\",VLOOKUP($I104,Prijslijst!A:D,4,FALSE))","v":""},null,null,null,{"$f":"IF(S104=\"\",\"\",(1/(1+Formulierdata!$A$29))*S104)","v":""},null,{"$f":"IF('Offerte goederen'!$W$22=1,IF(L104=\"\",\"\",IF(OR(O104=\"\",O104=0,O104=1),L104,L104*O104)),IF(L104=\"\",\"\",IF(OR(O104=\"\",O104=0,O104=1),L104*(1+Formulierdata!$A$29),L104*(1+Formulierdata!$A$29)*O104)))","v":""}]
[null,null,{"$f":"IF(I105=\"\",\"\",IF(ISERROR(VLOOKUP(I105,Prijslijst!A:B,2,FALSE)),\"Itemnummer onbekend\",VLOOKUP(I105,Prijslijst!A:B,2,FALSE)))","v":""},null,null,null,null,null,null,null,null,{"$f":"IF($I105=\"\",\"\",IF('Offerte goederen'!$W$22=1,VLOOKUP($I105,Prijslijst!A:E,5,FALSE),VLOOKUP($I105,Prijslijst!A:E,3,FALSE)))","v":""},{"$f":"IF(I105=\"\",\"\",VLOOKUP($I105,Prijslijst!A:D,4,FALSE))","v":""},null,null,null,{"$f":"IF(S105=\"\",\"\",(1/(1+Formulierdata!$A$29))*S105)","v":""},null,{"$f":"IF('Offerte goederen'!$W$22=1,IF(L105=\"\",\"\",IF(OR(O105=\"\",O105=0,O105=1),L105,L105*O105)),IF(L105=\"\",\"\",IF(OR(O105=\"\",O105=0,O105=1),L105*(1+Formulierdata!$A$29),L105*(1+Formulierdata!$A$29)*O105)))","v":""}]
[null,null,{"$f":"IF(I106=\"\",\"\",IF(ISERROR(VLOOKUP(I106,Prijslijst!A:B,2,FALSE)),\"Itemnummer onbekend\",VLOOKUP(I106,Prijslijst!A:B,2,FALSE)))","v":""},null,null,null,null,null,null,null,null,{"$f":"IF($I106=\"\",\"\",IF('Offerte goederen'!$W$22=1,VLOOKUP($I106,Prijslijst!A:E,5,FALSE),VLOOKUP($I106,Prijslijst!A:E,3,FALSE)))","v":""},{"$f":"IF(I106=\"\",\"\",VLOOKUP($I106,Prijslijst!A:D,4,FALSE))","v":""},null,null,null,{"$f":"IF(S106=\"\",\"\",(1/(1+Formulierdata!$A$29))*S106)","v":""},null,{"$f":"IF('Offerte goederen'!$W$22=1,IF(L106=\"\",\"\",IF(OR(O106=\"\",O106=0,O106=1),L106,L106*O106)),IF(L106=\"\",\"\",IF(OR(O106=\"\",O106=0,O106=1),L106*(1+Formulierdata!$A$29),L106*(1+Formulierdata!$A$29)*O106)))","v":""}]
[null,null,{"$f":"IF(I107=\"\",\"\",IF(ISERROR(VLOOKUP(I107,Prijslijst!A:B,2,FALSE)),\"Itemnummer onbekend\",VLOOKUP(I107,Prijslijst!A:B,2,FALSE)))","v":""},null,null,null,null,null,null,null,null,{"$f":"IF($I107=\"\",\"\",IF('Offerte goederen'!$W$22=1,VLOOKUP($I107,Prijslijst!A:E,5,FALSE),VLOOKUP($I107,Prijslijst!A:E,3,FALSE)))","v":""},{"$f":"IF(I107=\"\",\"\",VLOOKUP($I107,Prijslijst!A:D,4,FALSE))","v":""},null,null,null,{"$f":"IF(S107=\"\",\"\",(1/(1+Formulierdata!$A$29))*S107)","v":""},null,{"$f":"IF('Offerte goederen'!$W$22=1,IF(L107=\"\",\"\",IF(OR(O107=\"\",O107=0,O107=1),L107,L107*O107)),IF(L107=\"\",\"\",IF(OR(O107=\"\",O107=0,O107=1),L107*(1+Formulierdata!$A$29),L107*(1+Formulierdata!$A$29)*O107)))","v":""}]
[null,null,{"$f":"IF(I108=\"\",\"\",IF(ISERROR(VLOOKUP(I108,Prijslijst!A:B,2,FALSE)),\"Itemnummer onbekend\",VLOOKUP(I108,Prijslijst!A:B,2,FALSE)))","v":""},null,null,null,null,null,null,null,null,{"$f":"IF($I108=\"\",\"\",IF('Offerte goederen'!$W$22=1,VLOOKUP($I108,Prijslijst!A:E,5,FALSE),VLOOKUP($I108,Prijslijst!A:E,3,FALSE)))","v":""},{"$f":"IF(I108=\"\",\"\",VLOOKUP($I108,Prijslijst!A:D,4,FALSE))","v":""},null,null,null,{"$f":"IF(S108=\"\",\"\",(1/(1+Formulierdata!$A$29))*S108)","v":""},null,{"$f":"IF('Offerte goederen'!$W$22=1,IF(L108=\"\",\"\",IF(OR(O108=\"\",O108=0,O108=1),L108,L108*O108)),IF(L108=\"\",\"\",IF(OR(O108=\"\",O108=0,O108=1),L108*(1+Formulierdata!$A$29),L108*(1+Formulierdata!$A$29)*O108)))","v":""}]
[null,null,{"$f":"IF(I109=\"\",\"\",IF(ISERROR(VLOOKUP(I109,Prijslijst!A:B,2,FALSE)),\"Itemnummer onbekend\",VLOOKUP(I109,Prijslijst!A:B,2,FALSE)))","v":""},null,null,null,null,null,null,null,null,{"$f":"IF($I109=\"\",\"\",IF('Offerte goederen'!$W$22=1,VLOOKUP($I109,Prijslijst!A:E,5,FALSE),VLOOKUP($I109,Prijslijst!A:E,3,FALSE)))","v":""},{"$f":"IF(I109=\"\",\"\",VLOOKUP($I109,Prijslijst!A:D,4,FALSE))","v":""},null,null,null,{"$f":"IF(S109=\"\",\"\",(1/(1+Formulierdata!$A$29))*S109)","v":""},null,{"$f":"IF('Offerte goederen'!$W$22=1,IF(L109=\"\",\"\",IF(OR(O109=\"\",O109=0,O109=1),L109,L109*O109)),IF(L109=\"\",\"\",IF(OR(O109=\"\",O109=0,O109=1),L109*(1+Formulierdata!$A$29),L109*(1+Formulierdata!$A$29)*O109)))","v":""}]
[null,null,{"$f":"IF(I110=\"\",\"\",IF(ISERROR(VLOOKUP(I110,Prijslijst!A:B,2,FALSE)),\"Itemnummer onbekend\",VLOOKUP(I110,Prijslijst!A:B,2,FALSE)))","v":""},null,null,null,null,null,null,null,null,{"$f":"IF($I110=\"\",\"\",IF('Offerte goederen'!$W$22=1,VLOOKUP($I110,Prijslijst!A:E,5,FALSE),VLOOKUP($I110,Prijslijst!A:E,3,FALSE)))","v":""},{"$f":"IF(I110=\"\",\"\",VLOOKUP($I110,Prijslijst!A:D,4,FALSE))","v":""},null,null,null,{"$f":"IF(S110=\"\",\"\",(1/(1+Formulierdata!$A$29))*S110)","v":""},null,{"$f":"IF('Offerte goederen'!$W$22=1,IF(L110=\"\",\"\",IF(OR(O110=\"\",O110=0,O110=1),L110,L110*O110)),IF(L110=\"\",\"\",IF(OR(O110=\"\",O110=0,O110=1),L110*(1+Formulierdata!$A$29),L110*(1+Formulierdata!$A$29)*O110)))","v":""}]
[null,null,{"$f":"IF(I111=\"\",\"\",IF(ISERROR(VLOOKUP(I111,Prijslijst!A:B,2,FALSE)),\"Itemnummer onbekend\",VLOOKUP(I111,Prijslijst!A:B,2,FALSE)))","v":""},null,null,null,null,null,null,null,null,{"$f":"IF($I111=\"\",\"\",IF('Offerte goederen'!$W$22=1,VLOOKUP($I111,Prijslijst!A:E,5,FALSE),VLOOKUP($I111,Prijslijst!A:E,3,FALSE)))","v":""},{"$f":"IF(I111=\"\",\"\",VLOOKUP($I111,Prijslijst!A:D,4,FALSE))","v":""},null,null,null,{"$f":"IF(S111=\"\",\"\",(1/(1+Formulierdata!$A$29))*S111)","v":""},null,{"$f":"IF('Offerte goederen'!$W$22=1,IF(L111=\"\",\"\",IF(OR(O111=\"\",O111=0,O111=1),L111,L111*O111)),IF(L111=\"\",\"\",IF(OR(O111=\"\",O111=0,O111=1),L111*(1+Formulierdata!$A$29),L111*(1+Formulierdata!$A$29)*O111)))","v":""}]
[null,null,{"$f":"IF(I112=\"\",\"\",IF(ISERROR(VLOOKUP(I112,Prijslijst!A:B,2,FALSE)),\"Itemnummer onbekend\",VLOOKUP(I112,Prijslijst!A:B,2,FALSE)))","v":""},null,null,null,null,null,null,null,null,{"$f":"IF($I112=\"\",\"\",IF('Offerte goederen'!$W$22=1,VLOOKUP($I112,Prijslijst!A:E,5,FALSE),VLOOKUP($I112,Prijslijst!A:E,3,FALSE)))","v":""},{"$f":"IF(I112=\"\",\"\",VLOOKUP($I112,Prijslijst!A:D,4,FALSE))","v":""},null,null,null,{"$f":"IF(S112=\"\",\"\",(1/(1+Formulierdata!$A$29))*S112)","v":""},null,{"$f":"IF('Offerte goederen'!$W$22=1,IF(L112=\"\",\"\",IF(OR(O112=\"\",O112=0,O112=1),L112,L112*O112)),IF(L112=\"\",\"\",IF(OR(O112=\"\",O112=0,O112=1),L112*(1+Formulierdata!$A$29),L112*(1+Formulierdata!$A$29)*O112)))","v":""}]
[null,null,{"$f":"IF(I113=\"\",\"\",IF(ISERROR(VLOOKUP(I113,Prijslijst!A:B,2,FALSE)),\"Itemnummer onbekend\",VLOOKUP(I113,Prijslijst!A:B,2,FALSE)))","v":""},null,null,null,null,null,null,null,null,{"$f":"IF($I113=\"\",\"\",IF('Offerte goederen'!$W$22=1,VLOOKUP($I113,Prijslijst!A:E,5,FALSE),VLOOKUP($I113,Prijslijst!A:E,3,FALSE)))","v":""},{"$f":"IF(I113=\"\",\"\",VLOOKUP($I113,Prijslijst!A:D,4,FALSE))","v":""},null,null,null,{"$f":"IF(S113=\"\",\"\",(1/(1+Formulierdata!$A$29))*S113)","v":""},null,{"$f":"IF('Offerte goederen'!$W$22=1,IF(L113=\"\",\"\",IF(OR(O113=\"\",O113=0,O113=1),L113,L113*O113)),IF(L113=\"\",\"\",IF(OR(O113=\"\",O113=0,O113=1),L113*(1+Formulierdata!$A$29),L113*(1+Formulierdata!$A$29)*O113)))","v":""}]
[null,null,{"$f":"IF(I114=\"\",\"\",IF(ISERROR(VLOOKUP(I114,Prijslijst!A:B,2,FALSE)),\"Itemnummer onbekend\",VLOOKUP(I114,Prijslijst!A:B,2,FALSE)))","v":""},null,null,null,null,null,null,null,null,{"$f":"IF($I114=\"\",\"\",IF('Offerte goederen'!$W$22=1,VLOOKUP($I114,Prijslijst!A:E,5,FALSE),VLOOKUP($I114,Prijslijst!A:E,3,FALSE)))","v":""},{"$f":"IF(I114=\"\",\"\",VLOOKUP($I114,Prijslijst!A:D,4,FALSE))","v":""},null,null,null,{"$f":"IF(S114=\"\",\"\",(1/(1+Formulierdata!$A$29))*S114)","v":""},null,{"$f":"IF('Offerte goederen'!$W$22=1,IF(L114=\"\",\"\",IF(OR(O114=\"\",O114=0,O114=1),L114,L114*O114)),IF(L114=\"\",\"\",IF(OR(O114=\"\",O114=0,O114=1),L114*(1+Formulierdata!$A$29),L114*(1+Formulierdata!$A$29)*O114)))","v":""}]
[null,null,{"$f":"IF(I115=\"\",\"\",IF(ISERROR(VLOOKUP(I115,Prijslijst!A:B,2,FALSE)),\"Itemnummer onbekend\",VLOOKUP(I115,Prijslijst!A:B,2,FALSE)))","v":""},null,null,null,null,null,null,null,null,{"$f":"IF($I115=\"\",\"\",IF('Offerte goederen'!$W$22=1,VLOOKUP($I115,Prijslijst!A:E,5,FALSE),VLOOKUP($I115,Prijslijst!A:E,3,FALSE)))","v":""},{"$f":"IF(I115=\"\",\"\",VLOOKUP($I115,Prijslijst!A:D,4,FALSE))","v":""},null,null,null,{"$f":"IF(S115=\"\",\"\",(1/(1+Formulierdata!$A$29))*S115)","v":""},null,{"$f":"IF('Offerte goederen'!$W$22=1,IF(L115=\"\",\"\",IF(OR(O115=\"\",O115=0,O115=1),L115,L115*O115)),IF(L115=\"\",\"\",IF(OR(O115=\"\",O115=0,O115=1),L115*(1+Formulierdata!$A$29),L115*(1+Formulierdata!$A$29)*O115)))","v":""}]
[null,null,{"$f":"IF(I116=\"\",\"\",IF(ISERROR(VLOOKUP(I116,Prijslijst!A:B,2,FALSE)),\"Itemnummer onbekend\",VLOOKUP(I116,Prijslijst!A:B,2,FALSE)))","v":""},null,null,null,null,null,null,null,null,{"$f":"IF($I116=\"\",\"\",IF('Offerte goederen'!$W$22=1,VLOOKUP($I116,Prijslijst!A:E,5,FALSE),VLOOKUP($I116,Prijslijst!A:E,3,FALSE)))","v":""},{"$f":"IF(I116=\"\",\"\",VLOOKUP($I116,Prijslijst!A:D,4,FALSE))","v":""},null,null,null,{"$f":"IF(S116=\"\",\"\",(1/(1+Formulierdata!$A$29))*S116)","v":""},null,{"$f":"IF('Offerte goederen'!$W$22=1,IF(L116=\"\",\"\",IF(OR(O116=\"\",O116=0,O116=1),L116,L116*O116)),IF(L116=\"\",\"\",IF(OR(O116=\"\",O116=0,O116=1),L116*(1+Formulierdata!$A$29),L116*(1+Formulierdata!$A$29)*O116)))","v":""}]
[null,null,{"$f":"IF(I117=\"\",\"\",IF(ISERROR(VLOOKUP(I117,Prijslijst!A:B,2,FALSE)),\"Itemnummer onbekend\",VLOOKUP(I117,Prijslijst!A:B,2,FALSE)))","v":""},null,null,null,null,null,null,null,null,{"$f":"IF($I117=\"\",\"\",IF('Offerte goederen'!$W$22=1,VLOOKUP($I117,Prijslijst!A:E,5,FALSE),VLOOKUP($I117,Prijslijst!A:E,3,FALSE)))","v":""},{"$f":"IF(I117=\"\",\"\",VLOOKUP($I117,Prijslijst!A:D,4,FALSE))","v":""},null,null,null,{"$f":"IF(S117=\"\",\"\",(1/(1+Formulierdata!$A$29))*S117)","v":""},null,{"$f":"IF('Offerte goederen'!$W$22=1,IF(L117=\"\",\"\",IF(OR(O117=\"\",O117=0,O117=1),L117,L117*O117)),IF(L117=\"\",\"\",IF(OR(O117=\"\",O117=0,O117=1),L117*(1+Formulierdata!$A$29),L117*(1+Formulierdata!$A$29)*O117)))","v":""}]
[null,null,{"$f":"IF(I118=\"\",\"\",IF(ISERROR(VLOOKUP(I118,Prijslijst!A:B,2,FALSE)),\"Itemnummer onbekend\",VLOOKUP(I118,Prijslijst!A:B,2,FALSE)))","v":""},null,null,null,null,null,null,null,null,{"$f":"IF($I118=\"\",\"\",IF('Offerte goederen'!$W$22=1,VLOOKUP($I118,Prijslijst!A:E,5,FALSE),VLOOKUP($I118,Prijslijst!A:E,3,FALSE)))","v":""},{"$f":"IF(I118=\"\",\"\",VLOOKUP($I118,Prijslijst!A:D,4,FALSE))","v":""},null,null,null,{"$f":"IF(S118=\"\",\"\",(1/(1+Formulierdata!$A$29))*S118)","v":""},null,{"$f":"IF('Offerte goederen'!$W$22=1,IF(L118=\"\",\"\",IF(OR(O118=\"\",O118=0,O118=1),L118,L118*O118)),IF(L118=\"\",\"\",IF(OR(O118=\"\",O118=0,O118=1),L118*(1+Formulierdata!$A$29),L118*(1+Formulierdata!$A$29)*O118)))","v":""}]
[null,null,{"$f":"IF(I119=\"\",\"\",IF(ISERROR(VLOOKUP(I119,Prijslijst!A:B,2,FALSE)),\"Itemnummer onbekend\",VLOOKUP(I119,Prijslijst!A:B,2,FALSE)))","v":""},null,null,null,null,null,null,null,null,{"$f":"IF($I119=\"\",\"\",IF('Offerte goederen'!$W$22=1,VLOOKUP($I119,Prijslijst!A:E,5,FALSE),VLOOKUP($I119,Prijslijst!A:E,3,FALSE)))","v":""},{"$f":"IF(I119=\"\",\"\",VLOOKUP($I119,Prijslijst!A:D,4,FALSE))","v":""},null,null,null,{"$f":"IF(S119=\"\",\"\",(1/(1+Formulierdata!$A$29))*S119)","v":""},null,{"$f":"IF('Offerte goederen'!$W$22=1,IF(L119=\"\",\"\",IF(OR(O119=\"\",O119=0,O119=1),L119,L119*O119)),IF(L119=\"\",\"\",IF(OR(O119=\"\",O119=0,O119=1),L119*(1+Formulierdata!$A$29),L119*(1+Formulierdata!$A$29)*O119)))","v":""}]
[null,null,{"$f":"IF(I120=\"\",\"\",IF(ISERROR(VLOOKUP(I120,Prijslijst!A:B,2,FALSE)),\"Itemnummer onbekend\",VLOOKUP(I120,Prijslijst!A:B,2,FALSE)))","v":""},null,null,null,null,null,null,null,null,{"$f":"IF($I120=\"\",\"\",IF('Offerte goederen'!$W$22=1,VLOOKUP($I120,Prijslijst!A:E,5,FALSE),VLOOKUP($I120,Prijslijst!A:E,3,FALSE)))","v":""},{"$f":"IF(I120=\"\",\"\",VLOOKUP($I120,Prijslijst!A:D,4,FALSE))","v":""},null,null,null,{"$f":"IF(S120=\"\",\"\",(1/(1+Formulierdata!$A$29))*S120)","v":""},null,{"$f":"IF('Offerte goederen'!$W$22=1,IF(L120=\"\",\"\",IF(OR(O120=\"\",O120=0,O120=1),L120,L120*O120)),IF(L120=\"\",\"\",IF(OR(O120=\"\",O120=0,O120=1),L120*(1+Formulierdata!$A$29),L120*(1+Formulierdata!$A$29)*O120)))","v":""}]
[null,null,{"$f":"IF(I121=\"\",\"\",IF(ISERROR(VLOOKUP(I121,Prijslijst!A:B,2,FALSE)),\"Itemnummer onbekend\",VLOOKUP(I121,Prijslijst!A:B,2,FALSE)))","v":""},null,null,null,null,null,null,null,null,{"$f":"IF($I121=\"\",\"\",IF('Offerte goederen'!$W$22=1,VLOOKUP($I121,Prijslijst!A:E,5,FALSE),VLOOKUP($I121,Prijslijst!A:E,3,FALSE)))","v":""},{"$f":"IF(I121=\"\",\"\",VLOOKUP($I121,Prijslijst!A:D,4,FALSE))","v":""},null,null,null,{"$f":"IF(S121=\"\",\"\",(1/(1+Formulierdata!$A$29))*S121)","v":""},null,{"$f":"IF('Offerte goederen'!$W$22=1,IF(L121=\"\",\"\",IF(OR(O121=\"\",O121=0,O121=1),L121,L121*O121)),IF(L121=\"\",\"\",IF(OR(O121=\"\",O121=0,O121=1),L121*(1+Formulierdata!$A$29),L121*(1+Formulierdata!$A$29)*O121)))","v":""}]
[null,null,{"$f":"IF(I122=\"\",\"\",IF(ISERROR(VLOOKUP(I122,Prijslijst!A:B,2,FALSE)),\"Itemnummer onbekend\",VLOOKUP(I122,Prijslijst!A:B,2,FALSE)))","v":""},null,null,null,null,null,null,null,null,{"$f":"IF($I122=\"\",\"\",IF('Offerte goederen'!$W$22=1,VLOOKUP($I122,Prijslijst!A:E,5,FALSE),VLOOKUP($I122,Prijslijst!A:E,3,FALSE)))","v":""},{"$f":"IF(I122=\"\",\"\",VLOOKUP($I122,Prijslijst!A:D,4,FALSE))","v":""},null,null,null,{"$f":"IF(S122=\"\",\"\",(1/(1+Formulierdata!$A$29))*S122)","v":""},null,{"$f":"IF('Offerte goederen'!$W$22=1,IF(L122=\"\",\"\",IF(OR(O122=\"\",O122=0,O122=1),L122,L122*O122)),IF(L122=\"\",\"\",IF(OR(O122=\"\",O122=0,O122=1),L122*(1+Formulierdata!$A$29),L122*(1+Formulierdata!$A$29)*O122)))","v":""}]
[null,null,{"$f":"IF(I123=\"\",\"\",IF(ISERROR(VLOOKUP(I123,Prijslijst!A:B,2,FALSE)),\"Itemnummer onbekend\",VLOOKUP(I123,Prijslijst!A:B,2,FALSE)))","v":""},null,null,null,null,null,null,null,null,{"$f":"IF($I123=\"\",\"\",IF('Offerte goederen'!$W$22=1,VLOOKUP($I123,Prijslijst!A:E,5,FALSE),VLOOKUP($I123,Prijslijst!A:E,3,FALSE)))","v":""},{"$f":"IF(I123=\"\",\"\",VLOOKUP($I123,Prijslijst!A:D,4,FALSE))","v":""},null,null,null,{"$f":"IF(S123=\"\",\"\",(1/(1+Formulierdata!$A$29))*S123)","v":""},null,{"$f":"IF('Offerte goederen'!$W$22=1,IF(L123=\"\",\"\",IF(OR(O123=\"\",O123=0,O123=1),L123,L123*O123)),IF(L123=\"\",\"\",IF(OR(O123=\"\",O123=0,O123=1),L123*(1+Formulierdata!$A$29),L123*(1+Formulierdata!$A$29)*O123)))","v":""}]
[null,null,{"$f":"IF(I124=\"\",\"\",IF(ISERROR(VLOOKUP(I124,Prijslijst!A:B,2,FALSE)),\"Itemnummer onbekend\",VLOOKUP(I124,Prijslijst!A:B,2,FALSE)))","v":""},null,null,null,null,null,null,null,null,{"$f":"IF($I124=\"\",\"\",IF('Offerte goederen'!$W$22=1,VLOOKUP($I124,Prijslijst!A:E,5,FALSE),VLOOKUP($I124,Prijslijst!A:E,3,FALSE)))","v":""},{"$f":"IF(I124=\"\",\"\",VLOOKUP($I124,Prijslijst!A:D,4,FALSE))","v":""},null,null,null,{"$f":"IF(S124=\"\",\"\",(1/(1+Formulierdata!$A$29))*S124)","v":""},null,{"$f":"IF('Offerte goederen'!$W$22=1,IF(L124=\"\",\"\",IF(OR(O124=\"\",O124=0,O124=1),L124,L124*O124)),IF(L124=\"\",\"\",IF(OR(O124=\"\",O124=0,O124=1),L124*(1+Formulierdata!$A$29),L124*(1+Formulierdata!$A$29)*O124)))","v":""}]
[null,null,{"$f":"IF(I125=\"\",\"\",IF(ISERROR(VLOOKUP(I125,Prijslijst!A:B,2,FALSE)),\"Itemnummer onbekend\",VLOOKUP(I125,Prijslijst!A:B,2,FALSE)))","v":""},null,null,null,null,null,null,null,null,{"$f":"IF($I125=\"\",\"\",IF('Offerte goederen'!$W$22=1,VLOOKUP($I125,Prijslijst!A:E,5,FALSE),VLOOKUP($I125,Prijslijst!A:E,3,FALSE)))","v":""},{"$f":"IF(I125=\"\",\"\",VLOOKUP($I125,Prijslijst!A:D,4,FALSE))","v":""},null,null,null,{"$f":"IF(S125=\"\",\"\",(1/(1+Formulierdata!$A$29))*S125)","v":""},null,{"$f":"IF('Offerte goederen'!$W$22=1,IF(L125=\"\",\"\",IF(OR(O125=\"\",O125=0,O125=1),L125,L125*O125)),IF(L125=\"\",\"\",IF(OR(O125=\"\",O125=0,O125=1),L125*(1+Formulierdata!$A$29),L125*(1+Formulierdata!$A$29)*O125)))","v":""}]

{"sheet":"Vertrekaanduidingen","index":6,"n_rows":102,"n_cols":2,"rows_kept":102,"cut":false,"hidden":true,"merged":[]}
["Vertrekaanduiding (1)","*"]
[{"$f":"IF(Inmeetformulier!B25=\"\",\"\",Inmeetformulier!B25)","v":""},""]
[{"$f":"IF(Inmeetformulier!B26=\"\",\"\",Inmeetformulier!B26)","v":""}]
[{"$f":"IF(Inmeetformulier!B27=\"\",\"\",Inmeetformulier!B27)","v":""}]
[{"$f":"IF(Inmeetformulier!B28=\"\",\"\",Inmeetformulier!B28)","v":""}]
[{"$f":"IF(Inmeetformulier!B29=\"\",\"\",Inmeetformulier!B29)","v":""}]
[{"$f":"IF(Inmeetformulier!B30=\"\",\"\",Inmeetformulier!B30)","v":""}]
[{"$f":"IF(Inmeetformulier!B31=\"\",\"\",Inmeetformulier!B31)","v":""}]
[{"$f":"IF(Inmeetformulier!B32=\"\",\"\",Inmeetformulier!B32)","v":""}]
[{"$f":"IF(Inmeetformulier!B33=\"\",\"\",Inmeetformulier!B33)","v":""}]
[{"$f":"IF(Inmeetformulier!B34=\"\",\"\",Inmeetformulier!B34)","v":""}]
[{"$f":"IF(Inmeetformulier!B35=\"\",\"\",Inmeetformulier!B35)","v":""}]
[{"$f":"IF(Inmeetformulier!B36=\"\",\"\",Inmeetformulier!B36)","v":""}]
[{"$f":"IF(Inmeetformulier!B37=\"\",\"\",Inmeetformulier!B37)","v":""}]
[{"$f":"IF(Inmeetformulier!B38=\"\",\"\",Inmeetformulier!B38)","v":""}]
[{"$f":"IF(Inmeetformulier!B39=\"\",\"\",Inmeetformulier!B39)","v":""}]
[{"$f":"IF(Inmeetformulier!B40=\"\",\"\",Inmeetformulier!B40)","v":""}]
[{"$f":"IF(Inmeetformulier!B41=\"\",\"\",Inmeetformulier!B41)","v":""}]
[{"$f":"IF(Inmeetformulier!B42=\"\",\"\",Inmeetformulier!B42)","v":""}]
[{"$f":"IF(Inmeetformulier!B43=\"\",\"\",Inmeetformulier!B43)","v":""}]
[{"$f":"IF(Inmeetformulier!B44=\"\",\"\",Inmeetformulier!B44)","v":""}]
[{"$f":"IF(Inmeetformulier!B45=\"\",\"\",Inmeetformulier!B45)","v":""}]
[{"$f":"IF(Inmeetformulier!B46=\"\",\"\",Inmeetformulier!B46)","v":""}]
[{"$f":"IF(Inmeetformulier!B47=\"\",\"\",Inmeetformulier!B47)","v":""}]
[{"$f":"IF(Inmeetformulier!B48=\"\",\"\",Inmeetformulier!B48)","v":""}]
[{"$f":"IF(Inmeetformulier!B49=\"\",\"\",Inmeetformulier!B49)","v":""}]
[{"$f":"IF(Inmeetformulier!B50=\"\",\"\",Inmeetformulier!B50)","v":""}]
[{"$f":"IF(Inmeetformulier!B51=\"\",\"\",Inmeetformulier!B51)","v":""}]
[{"$f":"IF(Inmeetformulier!B52=\"\",\"\",Inmeetformulier!B52)","v":""}]
[{"$f":"IF(Inmeetformulier!B53=\"\",\"\",Inmeetformulier!B53)","v":""}]
[{"$f":"IF(Inmeetformulier!B54=\"\",\"\",Inmeetformulier!B54)","v":""}]
[{"$f":"IF(Inmeetformulier!B55=\"\",\"\",Inmeetformulier!B55)","v":""}]
[{"$f":"IF(Inmeetformulier!B56=\"\",\"\",Inmeetformulier!B56)","v":""}]
[{"$f":"IF(Inmeetformulier!B57=\"\",\"\",Inmeetformulier!B57)","v":""}]
[{"$f":"IF(Inmeetformulier!B58=\"\",\"\",Inmeetformulier!B58)","v":""}]
[{"$f":"IF(Inmeetformulier!B59=\"\",\"\",Inmeetformulier!B59)","v":""}]
[{"$f":"IF(Inmeetformulier!B60=\"\",\"\",Inmeetformulier!B60)","v":""}]
[{"$f":"IF(Inmeetformulier!B61=\"\",\"\",Inmeetformulier!B61)","v":""}]
[{"$f":"IF(Inmeetformulier!B62=\"\",\"\",Inmeetformulier!B62)","v":""}]
[{"$f":"IF(Inmeetformulier!B63=\"\",\"\",Inmeetformulier!B63)","v":""}]
[{"$f":"IF(Inmeetformulier!B64=\"\",\"\",Inmeetformulier!B64)","v":""}]
[{"$f":"IF(Inmeetformulier!B65=\"\",\"\",Inmeetformulier!B65)","v":""}]
[{"$f":"IF(Inmeetformulier!B66=\"\",\"\",Inmeetformulier!B66)","v":""}]
[{"$f":"IF(Inmeetformulier!B67=\"\",\"\",Inmeetformulier!B67)","v":""}]
[{"$f":"IF(Inmeetformulier!B68=\"\",\"\",Inmeetformulier!B68)","v":""}]
[{"$f":"IF(Inmeetformulier!B69=\"\",\"\",Inmeetformulier!B69)","v":""}]
[{"$f":"IF(Inmeetformulier!B70=\"\",\"\",Inmeetformulier!B70)","v":""}]
[{"$f":"IF(Inmeetformulier!B71=\"\",\"\",Inmeetformulier!B71)","v":""}]
[{"$f":"IF(Inmeetformulier!B72=\"\",\"\",Inmeetformulier!B72)","v":""}]
[{"$f":"IF(Inmeetformulier!B73=\"\",\"\",Inmeetformulier!B73)","v":""}]
[{"$f":"IF(Inmeetformulier!B74=\"\",\"\",Inmeetformulier!B74)","v":""}]
[{"$f":"IF(Inmeetformulier!B75=\"\",\"\",Inmeetformulier!B75)","v":""}]
[{"$f":"IF(Inmeetformulier!B76=\"\",\"\",Inmeetformulier!B76)","v":""}]
[{"$f":"IF(Inmeetformulier!B77=\"\",\"\",Inmeetformulier!B77)","v":""}]
[{"$f":"IF(Inmeetformulier!B78=\"\",\"\",Inmeetformulier!B78)","v":""}]
[{"$f":"IF(Inmeetformulier!B79=\"\",\"\",Inmeetformulier!B79)","v":""}]
[{"$f":"IF(Inmeetformulier!B80=\"\",\"\",Inmeetformulier!B80)","v":""}]
[{"$f":"IF(Inmeetformulier!B81=\"\",\"\",Inmeetformulier!B81)","v":""}]
[{"$f":"IF(Inmeetformulier!B82=\"\",\"\",Inmeetformulier!B82)","v":""}]
[{"$f":"IF(Inmeetformulier!B83=\"\",\"\",Inmeetformulier!B83)","v":""}]
[{"$f":"IF(Inmeetformulier!B84=\"\",\"\",Inmeetformulier!B84)","v":""}]
[{"$f":"IF(Inmeetformulier!B85=\"\",\"\",Inmeetformulier!B85)","v":""}]
[{"$f":"IF(Inmeetformulier!B86=\"\",\"\",Inmeetformulier!B86)","v":""}]
[{"$f":"IF(Inmeetformulier!B87=\"\",\"\",Inmeetformulier!B87)","v":""}]
[{"$f":"IF(Inmeetformulier!B88=\"\",\"\",Inmeetformulier!B88)","v":""}]
[{"$f":"IF(Inmeetformulier!B89=\"\",\"\",Inmeetformulier!B89)","v":""}]
[{"$f":"IF(Inmeetformulier!B90=\"\",\"\",Inmeetformulier!B90)","v":""}]
[{"$f":"IF(Inmeetformulier!B91=\"\",\"\",Inmeetformulier!B91)","v":""}]
[{"$f":"IF(Inmeetformulier!B92=\"\",\"\",Inmeetformulier!B92)","v":""}]
[{"$f":"IF(Inmeetformulier!B93=\"\",\"\",Inmeetformulier!B93)","v":""}]
[{"$f":"IF(Inmeetformulier!B94=\"\",\"\",Inmeetformulier!B94)","v":""}]
[{"$f":"IF(Inmeetformulier!B95=\"\",\"\",Inmeetformulier!B95)","v":""}]
[{"$f":"IF(Inmeetformulier!B96=\"\",\"\",Inmeetformulier!B96)","v":""}]
[{"$f":"IF(Inmeetformulier!B97=\"\",\"\",Inmeetformulier!B97)","v":""}]
[{"$f":"IF(Inmeetformulier!B98=\"\",\"\",Inmeetformulier!B98)","v":""}]
[{"$f":"IF(Inmeetformulier!B99=\"\",\"\",Inmeetformulier!B99)","v":""}]
[{"$f":"IF(Inmeetformulier!B100=\"\",\"\",Inmeetformulier!B100)","v":""}]
[{"$f":"IF(Inmeetformulier!B101=\"\",\"\",Inmeetformulier!B101)","v":""}]
[{"$f":"IF(Inmeetformulier!B102=\"\",\"\",Inmeetformulier!B102)","v":""}]
[{"$f":"IF(Inmeetformulier!B103=\"\",\"\",Inmeetformulier!B103)","v":""}]
[{"$f":"IF(Inmeetformulier!B104=\"\",\"\",Inmeetformulier!B104)","v":""}]
[{"$f":"IF(Inmeetformulier!B105=\"\",\"\",Inmeetformulier!B105)","v":""}]
[{"$f":"IF(Inmeetformulier!B106=\"\",\"\",Inmeetformulier!B106)","v":""}]
[{"$f":"IF(Inmeetformulier!B107=\"\",\"\",Inmeetformulier!B107)","v":""}]
[{"$f":"IF(Inmeetformulier!B108=\"\",\"\",Inmeetformulier!B108)","v":""}]
[{"$f":"IF(Inmeetformulier!B109=\"\",\"\",Inmeetformulier!B109)","v":""}]
[{"$f":"IF(Inmeetformulier!B110=\"\",\"\",Inmeetformulier!B110)","v":""}]
[{"$f":"IF(Inmeetformulier!B111=\"\",\"\",Inmeetformulier!B111)","v":""}]
[{"$f":"IF(Inmeetformulier!B112=\"\",\"\",Inmeetformulier!B112)","v":""}]
[{"$f":"IF(Inmeetformulier!B113=\"\",\"\",Inmeetformulier!B113)","v":""}]
[{"$f":"IF(Inmeetformulier!B114=\"\",\"\",Inmeetformulier!B114)","v":""}]
[{"$f":"IF(Inmeetformulier!B115=\"\",\"\",Inmeetformulier!B115)","v":""}]
[{"$f":"IF(Inmeetformulier!B116=\"\",\"\",Inmeetformulier!B116)","v":""}]
[{"$f":"IF(Inmeetformulier!B117=\"\",\"\",Inmeetformulier!B117)","v":""}]
[{"$f":"IF(Inmeetformulier!B118=\"\",\"\",Inmeetformulier!B118)","v":""}]
[{"$f":"IF(Inmeetformulier!B119=\"\",\"\",Inmeetformulier!B119)","v":""}]
[{"$f":"IF(Inmeetformulier!B120=\"\",\"\",Inmeetformulier!B120)","v":""}]
[{"$f":"IF(Inmeetformulier!B121=\"\",\"\",Inmeetformulier!B121)","v":""}]
[{"$f":"IF(Inmeetformulier!B122=\"\",\"\",Inmeetformulier!B122)","v":""}]
[{"$f":"IF(Inmeetformulier!B123=\"\",\"\",Inmeetformulier!B123)","v":""}]
[{"$f":"IF(Inmeetformulier!B124=\"\",\"\",Inmeetformulier!B124)","v":""}]
[{"$f":"IF(Inmeetformulier!B125=\"\",\"\",Inmeetformulier!B125)","v":""}]

{"sheet":"Prijslijst","index":7,"n_rows":101,"n_cols":5,"rows_kept":101,"cut":false,"hidden":true,"merged":[]}
["Item","Omschrijving","Prijs per eenh.\n(excl. BTW)","Eenheid","Prijs per eenh.\n(incl. BTW)"]
[1,"KS-Rail compleet incl. runners en plafondsteunen (zwart of wit)",9.5,"/m",{"$f":"IF(C2=\"\",\"\",C2*(1+Formulierdata!$A$29))","v":11.494999999999999}]
[2,"DS-Rail compleet incl. runners en plafondsteunen (zwart of wit)",10.75,"/m",{"$f":"IF(C3=\"\",\"\",C3*(1+Formulierdata!$A$29))","v":13.0075}]
[3,"Meerprijs bij KS/DS voor wandsteunen 35 mm",2.75,"/m",{"$f":"IF(C4=\"\",\"\",C4*(1+Formulierdata!$A$29))","v":3.3274999999999997}]
[4,"Meerprijs bij KS/DS voor wandsteunen 75 mm",4.5,"/m",{"$f":"IF(C5=\"\",\"\",C5*(1+Formulierdata!$A$29))","v":5.4450000000000003}]
[5,"G-rail 2100 compleet incl. runners en plafondsteunen",10,"/m",{"$f":"IF(C6=\"\",\"\",C6*(1+Formulierdata!$A$29))","v":12.1}]
[6,"Buigen KS- en G-rail per bocht",7.5,"/st",{"$f":"IF(C7=\"\",\"\",C7*(1+Formulierdata!$A$29))","v":9.0749999999999993}]
[7,"Buigen DS-rail per bocht",12.5,"/st",{"$f":"IF(C8=\"\",\"\",C8*(1+Formulierdata!$A$29))","v":15.125}]
[8,"Montage rails op plafondsteunen",5,"/m",{"$f":"IF(C9=\"\",\"\",C9*(1+Formulierdata!$A$29))","v":6.05}]
[9,"Montage rails op wandsteunen",6.5,"/m",{"$f":"IF(C10=\"\",\"\",C10*(1+Formulierdata!$A$29))","v":7.8650000000000002}]
[10,"Gordijnen hangen en stomen",9,"/m",{"$f":"IF(C11=\"\",\"\",C11*(1+Formulierdata!$A$29))","v":10.89}]
[11,"Montage railroede aan wandsteunen",7.5,"/m",{"$f":"IF(C12=\"\",\"\",C12*(1+Formulierdata!$A$29))","v":9.0749999999999993}]
[12,"Montage railroede aan plafondsteunen",8.75,"/m",{"$f":"IF(C13=\"\",\"\",C13*(1+Formulierdata!$A$29))","v":10.5875}]
[13,"Montage jaloezie, duette, vouw- of rolgordijn",17.5,"/st",{"$f":"IF(C14=\"\",\"\",C14*(1+Formulierdata!$A$29))","v":21.175000000000001}]
[14,"Montage verticale lamellen",25,"/st",{"$f":"IF(C15=\"\",\"\",C15*(1+Formulierdata!$A$29))","v":30.25}]
[15,"Montage inklemhorren",7.5,"/st",{"$f":"IF(C16=\"\",\"\",C16*(1+Formulierdata!$A$29))","v":9.0749999999999993}]
[16,"Montage plissé hordeuren",25,"/st",{"$f":"IF(C17=\"\",\"\",C17*(1+Formulierdata!$A$29))","v":30.25}]
[17,"Inmeten en verwerking inmeetbonnen regio Groot-Eindhoven",100,"/st",{"$f":"IF(C18=\"\",\"\",C18*(1+Formulierdata!$A$29))","v":121}]
[18,"Inmeten en verwerking inmeetbonnen < 50 km vanaf Eindhoven",150,"/st",{"$f":"IF(C19=\"\",\"\",C19*(1+Formulierdata!$A$29))","v":181.5}]
[19,"Inmeten en verwerking inmeetbonnen > 50 km vanaf Eindhoven",200,"/st",{"$f":"IF(C20=\"\",\"\",C20*(1+Formulierdata!$A$29))","v":242}]
[20,"Extra arbeid",50,"/u",{"$f":"IF(C21=\"\",\"\",C21*(1+Formulierdata!$A$29))","v":60.5}]
[21,"Kilometervergoeding",0.3,"/km",{"$f":"IF(C22=\"\",\"\",C22*(1+Formulierdata!$A$29))","v":0.36299999999999999}]
[22,null,null,null,{"$f":"IF(C23=\"\",\"\",C23*(1+Formulierdata!$A$29))","v":""}]
[23,null,null,null,{"$f":"IF(C24=\"\",\"\",C24*(1+Formulierdata!$A$29))","v":""}]
[24,null,null,null,{"$f":"IF(C25=\"\",\"\",C25*(1+Formulierdata!$A$29))","v":""}]
[25,null,null,null,{"$f":"IF(C26=\"\",\"\",C26*(1+Formulierdata!$A$29))","v":""}]
[26,null,null,null,{"$f":"IF(C27=\"\",\"\",C27*(1+Formulierdata!$A$29))","v":""}]
[27,null,null,null,{"$f":"IF(C28=\"\",\"\",C28*(1+Formulierdata!$A$29))","v":""}]
[28,null,null,null,{"$f":"IF(C29=\"\",\"\",C29*(1+Formulierdata!$A$29))","v":""}]
[29,null,null,null,{"$f":"IF(C30=\"\",\"\",C30*(1+Formulierdata!$A$29))","v":""}]
[30,null,null,null,{"$f":"IF(C31=\"\",\"\",C31*(1+Formulierdata!$A$29))","v":""}]
[31,null,null,null,{"$f":"IF(C32=\"\",\"\",C32*(1+Formulierdata!$A$29))","v":""}]
[32,null,null,null,{"$f":"IF(C33=\"\",\"\",C33*(1+Formulierdata!$A$29))","v":""}]
[33,null,null,null,{"$f":"IF(C34=\"\",\"\",C34*(1+Formulierdata!$A$29))","v":""}]
[34,null,null,null,{"$f":"IF(C35=\"\",\"\",C35*(1+Formulierdata!$A$29))","v":""}]
[35,null,null,null,{"$f":"IF(C36=\"\",\"\",C36*(1+Formulierdata!$A$29))","v":""}]
[36,null,null,null,{"$f":"IF(C37=\"\",\"\",C37*(1+Formulierdata!$A$29))","v":""}]
[37,null,null,null,{"$f":"IF(C38=\"\",\"\",C38*(1+Formulierdata!$A$29))","v":""}]
[38,null,null,null,{"$f":"IF(C39=\"\",\"\",C39*(1+Formulierdata!$A$29))","v":""}]
[39,null,null,null,{"$f":"IF(C40=\"\",\"\",C40*(1+Formulierdata!$A$29))","v":""}]
[40,null,null,null,{"$f":"IF(C41=\"\",\"\",C41*(1+Formulierdata!$A$29))","v":""}]
[41,null,null,null,{"$f":"IF(C42=\"\",\"\",C42*(1+Formulierdata!$A$29))","v":""}]
[42,null,null,null,{"$f":"IF(C43=\"\",\"\",C43*(1+Formulierdata!$A$29))","v":""}]
[43,null,null,null,{"$f":"IF(C44=\"\",\"\",C44*(1+Formulierdata!$A$29))","v":""}]
[44,null,null,null,{"$f":"IF(C45=\"\",\"\",C45*(1+Formulierdata!$A$29))","v":""}]
[45,null,null,null,{"$f":"IF(C46=\"\",\"\",C46*(1+Formulierdata!$A$29))","v":""}]
[46,null,null,null,{"$f":"IF(C47=\"\",\"\",C47*(1+Formulierdata!$A$29))","v":""}]
[47,null,null,null,{"$f":"IF(C48=\"\",\"\",C48*(1+Formulierdata!$A$29))","v":""}]
[48,null,null,null,{"$f":"IF(C49=\"\",\"\",C49*(1+Formulierdata!$A$29))","v":""}]
[49,null,null,null,{"$f":"IF(C50=\"\",\"\",C50*(1+Formulierdata!$A$29))","v":""}]
[50,"Kopje koffie drinken",25,"/u",{"$f":"IF(C51=\"\",\"\",C51*(1+Formulierdata!$A$29))","v":30.25}]
[51,null,null,null,{"$f":"IF(C52=\"\",\"\",C52*(1+Formulierdata!$A$29))","v":""}]
[52,null,null,null,{"$f":"IF(C53=\"\",\"\",C53*(1+Formulierdata!$A$29))","v":""}]
[53,null,null,null,{"$f":"IF(C54=\"\",\"\",C54*(1+Formulierdata!$A$29))","v":""}]
[54,null,null,null,{"$f":"IF(C55=\"\",\"\",C55*(1+Formulierdata!$A$29))","v":""}]
[55,null,null,null,{"$f":"IF(C56=\"\",\"\",C56*(1+Formulierdata!$A$29))","v":""}]
[56,null,null,null,{"$f":"IF(C57=\"\",\"\",C57*(1+Formulierdata!$A$29))","v":""}]
[57,null,null,null,{"$f":"IF(C58=\"\",\"\",C58*(1+Formulierdata!$A$29))","v":""}]
[58,null,null,null,{"$f":"IF(C59=\"\",\"\",C59*(1+Formulierdata!$A$29))","v":""}]
[59,null,null,null,{"$f":"IF(C60=\"\",\"\",C60*(1+Formulierdata!$A$29))","v":""}]
[60,null,null,null,{"$f":"IF(C61=\"\",\"\",C61*(1+Formulierdata!$A$29))","v":""}]
[61,null,null,null,{"$f":"IF(C62=\"\",\"\",C62*(1+Formulierdata!$A$29))","v":""}]
[62,null,null,null,{"$f":"IF(C63=\"\",\"\",C63*(1+Formulierdata!$A$29))","v":""}]
[63,null,null,null,{"$f":"IF(C64=\"\",\"\",C64*(1+Formulierdata!$A$29))","v":""}]
[64,null,null,null,{"$f":"IF(C65=\"\",\"\",C65*(1+Formulierdata!$A$29))","v":""}]
[65,null,null,null,{"$f":"IF(C66=\"\",\"\",C66*(1+Formulierdata!$A$29))","v":""}]
[66,null,null,null,{"$f":"IF(C67=\"\",\"\",C67*(1+Formulierdata!$A$29))","v":""}]
[67,null,null,null,{"$f":"IF(C68=\"\",\"\",C68*(1+Formulierdata!$A$29))","v":""}]
[68,null,null,null,{"$f":"IF(C69=\"\",\"\",C69*(1+Formulierdata!$A$29))","v":""}]
[69,null,null,null,{"$f":"IF(C70=\"\",\"\",C70*(1+Formulierdata!$A$29))","v":""}]
[70,null,null,null,{"$f":"IF(C71=\"\",\"\",C71*(1+Formulierdata!$A$29))","v":""}]
[71,null,null,null,{"$f":"IF(C72=\"\",\"\",C72*(1+Formulierdata!$A$29))","v":""}]
[72,null,null,null,{"$f":"IF(C73=\"\",\"\",C73*(1+Formulierdata!$A$29))","v":""}]
[73,null,null,null,{"$f":"IF(C74=\"\",\"\",C74*(1+Formulierdata!$A$29))","v":""}]
[74,null,null,null,{"$f":"IF(C75=\"\",\"\",C75*(1+Formulierdata!$A$29))","v":""}]
[75,null,null,null,{"$f":"IF(C76=\"\",\"\",C76*(1+Formulierdata!$A$29))","v":""}]
[76,null,null,null,{"$f":"IF(C77=\"\",\"\",C77*(1+Formulierdata!$A$29))","v":""}]
[77,null,null,null,{"$f":"IF(C78=\"\",\"\",C78*(1+Formulierdata!$A$29))","v":""}]
[78,null,null,null,{"$f":"IF(C79=\"\",\"\",C79*(1+Formulierdata!$A$29))","v":""}]
[79,null,null,null,{"$f":"IF(C80=\"\",\"\",C80*(1+Formulierdata!$A$29))","v":""}]
[80,null,null,null,{"$f":"IF(C81=\"\",\"\",C81*(1+Formulierdata!$A$29))","v":""}]
[81,null,null,null,{"$f":"IF(C82=\"\",\"\",C82*(1+Formulierdata!$A$29))","v":""}]
[82,null,null,null,{"$f":"IF(C83=\"\",\"\",C83*(1+Formulierdata!$A$29))","v":""}]
[83,null,null,null,{"$f":"IF(C84=\"\",\"\",C84*(1+Formulierdata!$A$29))","v":""}]
[84,null,null,null,{"$f":"IF(C85=\"\",\"\",C85*(1+Formulierdata!$A$29))","v":""}]
[85,null,null,null,{"$f":"IF(C86=\"\",\"\",C86*(1+Formulierdata!$A$29))","v":""}]
[86,null,null,null,{"$f":"IF(C87=\"\",\"\",C87*(1+Formulierdata!$A$29))","v":""}]
[87,null,null,null,{"$f":"IF(C88=\"\",\"\",C88*(1+Formulierdata!$A$29))","v":""}]
[88,null,null,null,{"$f":"IF(C89=\"\",\"\",C89*(1+Formulierdata!$A$29))","v":""}]
[89,null,null,null,{"$f":"IF(C90=\"\",\"\",C90*(1+Formulierdata!$A$29))","v":""}]
[90,null,null,null,{"$f":"IF(C91=\"\",\"\",C91*(1+Formulierdata!$A$29))","v":""}]
[91,null,null,null,{"$f":"IF(C92=\"\",\"\",C92*(1+Formulierdata!$A$29))","v":""}]
[92,null,null,null,{"$f":"IF(C93=\"\",\"\",C93*(1+Formulierdata!$A$29))","v":""}]
[93,null,null,null,{"$f":"IF(C94=\"\",\"\",C94*(1+Formulierdata!$A$29))","v":""}]
[94,null,null,null,{"$f":"IF(C95=\"\",\"\",C95*(1+Formulierdata!$A$29))","v":""}]
[95,null,null,null,{"$f":"IF(C96=\"\",\"\",C96*(1+Formulierdata!$A$29))","v":""}]
[96,null,null,null,{"$f":"IF(C97=\"\",\"\",C97*(1+Formulierdata!$A$29))","v":""}]
[97,null,null,null,{"$f":"IF(C98=\"\",\"\",C98*(1+Formulierdata!$A$29))","v":""}]
[98,null,null,null,{"$f":"IF(C99=\"\",\"\",C99*(1+Formulierdata!$A$29))","v":""}]
[99,null,null,null,{"$f":"IF(C100=\"\",\"\",C100*(1+Formulierdata!$A$29))","v":""}]
[100,"Anders, zie toelichting",null,null,{"$f":"IF(C101=\"\",\"\",C101*(1+Formulierdata!$A$29))","v":""}]

{"sheet":"Offerte totaal","index":8,"n_rows":24,"n_cols":14,"rows_kept":24,"cut":false,"hidden":true,"merged":[[21,1,21,2],[21,9,21,11],[12,9,12,11],[15,4,15,7],[15,9,15,11],[16,4,16,7],[16,9,16,11],[17,4,17,7],[17,9,17,11],[18,4,18,7],[18,9,18,11],[19,9,19,11],[20,9,20,11],[19,4,19,7],[10,9,10,11],[4,9,4,11],[5,9,5,11],[6,9,6,11],[8,9,8,11],[9,9,9,11]]}
[]
[null,null,{"$f":"IF(Dossier!C21=\"\",\"Klantofferte\",\"Klantofferte (bevestigd)\")","v":"Klantofferte"}]
[null,null,null,null,null,null,null,null,4]
[]
[null,"Naam klant/contactpers.:",{"$f":"CONCATENATE(IF('Offerte goederen'!C5=0,\"\",'Offerte goederen'!C5),\" \",IF('Offerte goederen'!D5=0,\"\",'Offerte goederen'!D5),\" \",IF('Offerte goederen'!E5=0,\"\",'Offerte goederen'!E5))","v":"  "}]
[null,"Organisatie:",{"$f":"'Offerte goederen'!C6","v":0}]
[null,"Montage-adres:",{"$f":"'Offerte goederen'!C7","v":0}]
[null,"Postcode/Wplts.:",{"$f":"CONCATENATE(IF('Offerte goederen'!C8=0,\"\",'Offerte goederen'!C8),\" \",IF('Offerte goederen'!D8=0,\"\",'Offerte goederen'!D8))","v":" "}]
[null,"Land:",{"$f":"'Offerte goederen'!C9","v":0}]
[null,"E-mailadres:",{"$f":"'Offerte goederen'!C10","v":0}]
[]
[null,"Telefoon 1:",{"$f":"CONCATENATE(IF('Offerte goederen'!C12=0,\"\",CONCATENATE(\"+\",'Offerte goederen'!C12)),\" \",IF('Offerte goederen'!D12=0,\"\",'Offerte goederen'!D12))","v":" "}]
[null,"Telefoon 2:",{"$f":"CONCATENATE(IF('Offerte goederen'!C13=0,\"\",CONCATENATE(\"+\",'Offerte goederen'!C13)),\" \",IF('Offerte goederen'!D13=0,\"\",'Offerte goederen'!D13))","v":" "}]
[null,null,null,null,null,null,null,null,null,null,null,null,{"$f":"IF(AND(M15=FALSE,M16=\"% na\"),\"j\",IF(AND(M15=FALSE,M16=\"% voor\"),\"i\",IF(AND(M15=FALSE,M16=\"EUR na\"),\"h\",IF(AND(M15=FALSE,M16=\"EUR voor\"),\"g\",IF(AND(M15=FALSE,M16=\"x\"),\"f\",IF(AND(M15=TRUE,M16=\"% na\"),\"e\",IF(AND(M15=TRUE,M16=\"% voor\"),\"d\",IF(AND(M15=TRUE,M16=\"EUR na\"),\"c\",IF(AND(M15=TRUE,M16=\"EUR voor\"),\"b\",\"a\")))))))))","v":"a"}]
[null,"Datum:",null,null,null,null,null,null,null,null,null,null,true]
[null,"Behorend bij inmeting d.d.:",null,null,{"$f":"IF(AND(M15=TRUE,M16=\"x\"),\"Totaalbedrag (excl. BTW): \",IF(M15=FALSE,\"Totaalbedrag (BTW verlegd): \",\"Totaalbedrag voor korting (excl. BTW): \"))","v":"Totaalbedrag (excl. BTW): "},null,null,null,null,{"$f":"SUBTOTAL(9,L25:L205)","v":0},null,null,"x"]
[null,null,null,null,{"$f":"IF(OR(M14=\"c\",M14=\"e\"),CONCATENATE(\"+ BTW (\",100*Formulierdata!A29,\"%): \"),IF(OR(M14=\"b\",M14=\"d\"),\"-/- Korting: \",\"\"))","v":""},null,null,null,null,0]
[null,"Projectomschrijving klant:",{"$f":"'Offerte goederen'!C18","v":0},null,{"$f":"IF(OR(M14=\"b\",M14=\"d\"),\"Totaalbedrag na korting (excl. BTW): \",IF(OR(M14=\"c\",M14=\"e\"),\"Totaalbedrag voor korting (incl. BTW): \",\"\"))","v":""},null,null,null,null,{"$f":"IF(OR($M$14=\"a\",$M$14=\"f\",$M$14=\"g\",$M$14=\"h\",$M$14=\"i\",$M$14=\"j\"),$J$16,IF($M$14=\"b\",$J$16-$J$17,IF($M$14=\"d\",$J$16-($J$17*$J$16),IF(OR($M$14=\"c\",$M$14=\"e\"),$J$16+($J$16*Formulierdata!$A$29)))))","v":0}]
[null,null,{"$f":"'Offerte goederen'!C19","v":0},null,{"$f":"IF(OR(M14=\"a\",M14=\"b\",M14=\"d\"),CONCATENATE(\"+ BTW (\",100*Formulierdata!A29,\"%): \"),IF(OR(M14=\"c\",M14=\"e\",M14=\"g\",M14=\"h\",M14=\"i\",M14=\"j\"),\"-/- Korting: \",\"\"))","v":"+ BTW (21%): "},null,null,null,null,{"$f":"IF(OR($M$14=\"f\",$M$14=\"g\",$M$14=\"h\",$M$14=\"i\"),\"\",IF($M$14=\"a\",Formulierdata!$A$29*$J$16,IF(OR($M$14=\"b\",$M$14=\"d\"),Formulierdata!$A$29*$J$18,0)))","v":0}]
[null,null,{"$f":"'Offerte goederen'!C20","v":0},null,{"$f":"IF(OR(M14=\"b\",M14=\"d\",M14=\"c\",M14=\"e\"),\"Totaalbedrag na korting (incl. BTW): \",IF(M14=\"a\",\"Totaalbedrag (incl. BTW): \",IF(OR(M14=\"g\",M14=\"h\",M14=\"i\",M14=\"j\"),\"Totaalbedrag na korting (BTW verlegd): \",\"\")))","v":"Totaalbedrag (incl. BTW): "},null,null,null,null,{"$f":"IF(OR($M$14=\"a\",$M$14=\"b\",$M$14=\"d\"),$J$18+$J$19,IF(OR($M$14=\"c\",$M$14=\"g\", $M$14=\"h\"),$J$18-$J$19,IF(OR($M$14=\"e\",$M$14=\"i\",$M$14=\"j\"),$J$18-($J$19*$J$18),\"\")))","v":0}]
[]
[]
[]
[null,"Vertrek","Omschrijving (G = Goederen, M = Montage- en overige kosten)",null,"Toelichting (evt.)",null,{"$f":"'Offerte goederen'!R24","v":"Prijs       (excl. BTW)"},"per",null,"Aantal\neenh.",null,"Bedrag\n(excl. BTW)",null,"Bedrag\n(incl. BTW)"]

{"sheet":"Bestelformulier","index":9,"n_rows":123,"n_cols":17,"rows_kept":123,"cut":false,"hidden":true,"merged":[[18,11,18,13],[18,2,18,7],[19,2,19,7],[17,2,17,7],[12,2,12,7],[13,2,13,7],[14,3,14,7],[15,2,15,7],[17,9,17,10],[17,11,17,13],[4,2,4,7],[6,2,6,7],[7,2,7,7],[8,3,8,7],[10,2,10,7],[5,2,5,7]]}
[]
[null,null,"Bestelformulier"]
[]
[]
[null,"Merk"]
[null,"Leverancier",{"$f":"IF(ISERROR(VLOOKUP($C$5,Leveranciersdata!$A:$G,2,FALSE)),\"\",VLOOKUP($C$5,Leveranciersdata!$A:$G,2,FALSE))","v":""}]
[null,"T.a.v. ",{"$f":"IF(ISERROR(VLOOKUP($C$5,Leveranciersdata!$A:$G,3,FALSE)),\"\",VLOOKUP($C$5,Leveranciersdata!$A:$G,3,FALSE))","v":""}]
[null,"Adres",{"$f":"IF(ISERROR(VLOOKUP($C$5,Leveranciersdata!$A:$G,4,FALSE)),\"\",VLOOKUP($C$5,Leveranciersdata!$A:$G,4,FALSE))","v":""}]
[null,"Postcode/Wplts.:",{"$f":"IF(ISERROR(VLOOKUP($C$5,Leveranciersdata!$A:$G,5,FALSE)),\"\",VLOOKUP($C$5,Leveranciersdata!$A:$G,5,FALSE))","v":""},{"$f":"IF(ISERROR(VLOOKUP($C$5,Leveranciersdata!$A:$G,6,FALSE)),\"\",VLOOKUP($C$5,Leveranciersdata!$A:$G,6,FALSE))","v":""},{"$f":"VLOOKUP($C$5,Leveranciersdata!$A:$G,5,FALSE)","v":{"$error":"#N/A"}},{"$f":"VLOOKUP($C$5,Leveranciersdata!$A:$G,5,FALSE)","v":{"$error":"#N/A"}},{"$f":"VLOOKUP($C$5,Leveranciersdata!$A:$G,5,FALSE)","v":{"$error":"#N/A"}},{"$f":"VLOOKUP($C$5,Leveranciersdata!$A:$G,5,FALSE)","v":{"$error":"#N/A"}}]
[]
[null,null,"Wij verzoeken u om levering van onderstaande artikelen ten behoeve van een project met de volgende kenmerken:"]
[]
[null,"Organisatie:",{"$f":"Inmeetformulier!C6","v":0},{"$f":"Inmeetaanvraag!D6","v":0},{"$f":"Inmeetaanvraag!E6","v":0},{"$f":"Inmeetaanvraag!F6","v":0},{"$f":"Inmeetaanvraag!G6","v":0},{"$f":"Inmeetaanvraag!H6","v":0}]
[null,"Montage-adres:",{"$f":"Inmeetformulier!C7","v":0},{"$f":"Inmeetaanvraag!D7","v":0},{"$f":"Inmeetaanvraag!E7","v":0},{"$f":"Inmeetaanvraag!F7","v":0},{"$f":"Inmeetaanvraag!G7","v":0},{"$f":"Inmeetaanvraag!H7","v":0}]
[null,"Postcode/Wplts.:",{"$f":"Inmeetformulier!C8","v":0},{"$f":"Inmeetformulier!D8","v":0},{"$f":"Inmeetaanvraag!E8","v":0},{"$f":"Inmeetaanvraag!F8","v":0},{"$f":"Inmeetaanvraag!G8","v":0},{"$f":"Inmeetaanvraag!H8","v":0}]
[null,"Land:",{"$f":"Inmeetformulier!C9","v":0},{"$f":"Inmeetaanvraag!D9","v":0},{"$f":"Inmeetaanvraag!E9","v":0},{"$f":"Inmeetaanvraag!F9","v":0},{"$f":"Inmeetaanvraag!G9","v":0},{"$f":"Inmeetaanvraag!H9","v":0}]
[]
[null,"Projectomschrijving:",{"$f":"Inmeetformulier!C18","v":0},{"$f":"Inmeetaanvraag!#REF!","v":{"$error":"#REF!"}},{"$f":"Inmeetaanvraag!#REF!","v":{"$error":"#REF!"}},{"$f":"Inmeetaanvraag!#REF!","v":{"$error":"#REF!"}},{"$f":"Inmeetaanvraag!#REF!","v":{"$error":"#REF!"}},{"$f":"Inmeetaanvraag!#REF!","v":{"$error":"#REF!"}},null,"Levering gewenst op:"]
[null,null,{"$f":"Inmeetformulier!C19","v":0},{"$f":"Inmeetaanvraag!#REF!","v":{"$error":"#REF!"}},{"$f":"Inmeetaanvraag!#REF!","v":{"$error":"#REF!"}},{"$f":"Inmeetaanvraag!#REF!","v":{"$error":"#REF!"}},{"$f":"Inmeetaanvraag!#REF!","v":{"$error":"#REF!"}},{"$f":"Inmeetaanvraag!#REF!","v":{"$error":"#REF!"}},null,null,"Afleveradres:"]
[null,null,{"$f":"Inmeetformulier!C20","v":0},{"$f":"Inmeetaanvraag!#REF!","v":{"$error":"#REF!"}},{"$f":"Inmeetaanvraag!#REF!","v":{"$error":"#REF!"}},{"$f":"Inmeetaanvraag!#REF!","v":{"$error":"#REF!"}},{"$f":"Inmeetaanvraag!#REF!","v":{"$error":"#REF!"}},{"$f":"Inmeetaanvraag!#REF!","v":{"$error":"#REF!"}}]
[]
[null,"Artikelomschrijving","Merk","Breedte\n(cm)","Hoogte\n(cm)","Strak/\nBlijv.","Stel/\nStuk","Plooi","Rail-lngt. (cm)","Rail-\ntype","Rail-\nkleur","Bevest.","Mate-\nriaal","Bedie-\nning","Hoofdje","Vertrek","Opmerkingen"]
[null,{"$f":"IF(Inmeetformulier!P25=\"\",\"\",Inmeetformulier!P25)","v":""},{"$f":"IF(Inmeetformulier!Q25=\"\",\"\",Inmeetformulier!Q25)","v":""},{"$f":"IF(Inmeetformulier!D25=\"\",\"\",Inmeetformulier!D25)","v":""},{"$f":"IF(Inmeetformulier!E25=\"\",\"\",Inmeetformulier!E25)","v":""},{"$f":"IF(Inmeetformulier!F25=\"\",\"\",Inmeetformulier!F25)","v":""},{"$f":"IF(Inmeetformulier!G25=\"\",\"\",Inmeetformulier!G25)","v":""},{"$f":"IF(Inmeetformulier!H25=\"\",\"\",Inmeetformulier!H25)","v":""},{"$f":"IF(Inmeetformulier!I25=\"\",\"\",Inmeetformulier!I25)","v":""},{"$f":"IF(Inmeetformulier!J25=\"\",\"\",Inmeetformulier!J25)","v":""},{"$f":"IF(Inmeetformulier!K25=\"\",\"\",Inmeetformulier!K25)","v":""},{"$f":"IF(Inmeetformulier!L25=\"\",\"\",Inmeetformulier!L25)","v":""},{"$f":"IF(Inmeetformulier!M25=\"\",\"\",Inmeetformulier!M25)","v":""},{"$f":"IF(Inmeetformulier!N25=\"\",\"\",Inmeetformulier!N25)","v":""},{"$f":"IF(Inmeetformulier!O25=\"\",\"\",Inmeetformulier!O25)","v":""},{"$f":"IF(Inmeetformulier!B25=\"\",\"\",Inmeetformulier!B25)","v":""},{"$f":"IF(Inmeetformulier!S25=\"\",\"\",Inmeetformulier!S25)","v":""}]
[null,{"$f":"IF(Inmeetformulier!P26=\"\",\"\",Inmeetformulier!P26)","v":""},{"$f":"IF(Inmeetformulier!Q26=\"\",\"\",Inmeetformulier!Q26)","v":""},{"$f":"IF(Inmeetformulier!D26=\"\",\"\",Inmeetformulier!D26)","v":""},{"$f":"IF(Inmeetformulier!E26=\"\",\"\",Inmeetformulier!E26)","v":""},{"$f":"IF(Inmeetformulier!F26=\"\",\"\",Inmeetformulier!F26)","v":""},{"$f":"IF(Inmeetformulier!G26=\"\",\"\",Inmeetformulier!G26)","v":""},{"$f":"IF(Inmeetformulier!H26=\"\",\"\",Inmeetformulier!H26)","v":""},{"$f":"IF(Inmeetformulier!I26=\"\",\"\",Inmeetformulier!I26)","v":""},{"$f":"IF(Inmeetformulier!J26=\"\",\"\",Inmeetformulier!J26)","v":""},{"$f":"IF(Inmeetformulier!K26=\"\",\"\",Inmeetformulier!K26)","v":""},{"$f":"IF(Inmeetformulier!L26=\"\",\"\",Inmeetformulier!L26)","v":""},{"$f":"IF(Inmeetformulier!M26=\"\",\"\",Inmeetformulier!M26)","v":""},{"$f":"IF(Inmeetformulier!N26=\"\",\"\",Inmeetformulier!N26)","v":""},{"$f":"IF(Inmeetformulier!O26=\"\",\"\",Inmeetformulier!O26)","v":""},{"$f":"IF(Inmeetformulier!B26=\"\",\"\",Inmeetformulier!B26)","v":""},{"$f":"IF(Inmeetformulier!S26=\"\",\"\",Inmeetformulier!S26)","v":""}]
[null,{"$f":"IF(Inmeetformulier!P27=\"\",\"\",Inmeetformulier!P27)","v":""},{"$f":"IF(Inmeetformulier!Q27=\"\",\"\",Inmeetformulier!Q27)","v":""},{"$f":"IF(Inmeetformulier!D27=\"\",\"\",Inmeetformulier!D27)","v":""},{"$f":"IF(Inmeetformulier!E27=\"\",\"\",Inmeetformulier!E27)","v":""},{"$f":"IF(Inmeetformulier!F27=\"\",\"\",Inmeetformulier!F27)","v":""},{"$f":"IF(Inmeetformulier!G27=\"\",\"\",Inmeetformulier!G27)","v":""},{"$f":"IF(Inmeetformulier!H27=\"\",\"\",Inmeetformulier!H27)","v":""},{"$f":"IF(Inmeetformulier!I27=\"\",\"\",Inmeetformulier!I27)","v":""},{"$f":"IF(Inmeetformulier!J27=\"\",\"\",Inmeetformulier!J27)","v":""},{"$f":"IF(Inmeetformulier!K27=\"\",\"\",Inmeetformulier!K27)","v":""},{"$f":"IF(Inmeetformulier!L27=\"\",\"\",Inmeetformulier!L27)","v":""},{"$f":"IF(Inmeetformulier!M27=\"\",\"\",Inmeetformulier!M27)","v":""},{"$f":"IF(Inmeetformulier!N27=\"\",\"\",Inmeetformulier!N27)","v":""},{"$f":"IF(Inmeetformulier!O27=\"\",\"\",Inmeetformulier!O27)","v":""},{"$f":"IF(Inmeetformulier!B27=\"\",\"\",Inmeetformulier!B27)","v":""},{"$f":"IF(Inmeetformulier!S27=\"\",\"\",Inmeetformulier!S27)","v":""}]
[null,{"$f":"IF(Inmeetformulier!P28=\"\",\"\",Inmeetformulier!P28)","v":""},{"$f":"IF(Inmeetformulier!Q28=\"\",\"\",Inmeetformulier!Q28)","v":""},{"$f":"IF(Inmeetformulier!D28=\"\",\"\",Inmeetformulier!D28)","v":""},{"$f":"IF(Inmeetformulier!E28=\"\",\"\",Inmeetformulier!E28)","v":""},{"$f":"IF(Inmeetformulier!F28=\"\",\"\",Inmeetformulier!F28)","v":""},{"$f":"IF(Inmeetformulier!G28=\"\",\"\",Inmeetformulier!G28)","v":""},{"$f":"IF(Inmeetformulier!H28=\"\",\"\",Inmeetformulier!H28)","v":""},{"$f":"IF(Inmeetformulier!I28=\"\",\"\",Inmeetformulier!I28)","v":""},{"$f":"IF(Inmeetformulier!J28=\"\",\"\",Inmeetformulier!J28)","v":""},{"$f":"IF(Inmeetformulier!K28=\"\",\"\",Inmeetformulier!K28)","v":""},{"$f":"IF(Inmeetformulier!L28=\"\",\"\",Inmeetformulier!L28)","v":""},{"$f":"IF(Inmeetformulier!M28=\"\",\"\",Inmeetformulier!M28)","v":""},{"$f":"IF(Inmeetformulier!N28=\"\",\"\",Inmeetformulier!N28)","v":""},{"$f":"IF(Inmeetformulier!O28=\"\",\"\",Inmeetformulier!O28)","v":""},{"$f":"IF(Inmeetformulier!B28=\"\",\"\",Inmeetformulier!B28)","v":""},{"$f":"IF(Inmeetformulier!S28=\"\",\"\",Inmeetformulier!S28)","v":""}]
[null,{"$f":"IF(Inmeetformulier!P29=\"\",\"\",Inmeetformulier!P29)","v":""},{"$f":"IF(Inmeetformulier!Q29=\"\",\"\",Inmeetformulier!Q29)","v":""},{"$f":"IF(Inmeetformulier!D29=\"\",\"\",Inmeetformulier!D29)","v":""},{"$f":"IF(Inmeetformulier!E29=\"\",\"\",Inmeetformulier!E29)","v":""},{"$f":"IF(Inmeetformulier!F29=\"\",\"\",Inmeetformulier!F29)","v":""},{"$f":"IF(Inmeetformulier!G29=\"\",\"\",Inmeetformulier!G29)","v":""},{"$f":"IF(Inmeetformulier!H29=\"\",\"\",Inmeetformulier!H29)","v":""},{"$f":"IF(Inmeetformulier!I29=\"\",\"\",Inmeetformulier!I29)","v":""},{"$f":"IF(Inmeetformulier!J29=\"\",\"\",Inmeetformulier!J29)","v":""},{"$f":"IF(Inmeetformulier!K29=\"\",\"\",Inmeetformulier!K29)","v":""},{"$f":"IF(Inmeetformulier!L29=\"\",\"\",Inmeetformulier!L29)","v":""},{"$f":"IF(Inmeetformulier!M29=\"\",\"\",Inmeetformulier!M29)","v":""},{"$f":"IF(Inmeetformulier!N29=\"\",\"\",Inmeetformulier!N29)","v":""},{"$f":"IF(Inmeetformulier!O29=\"\",\"\",Inmeetformulier!O29)","v":""},{"$f":"IF(Inmeetformulier!B29=\"\",\"\",Inmeetformulier!B29)","v":""},{"$f":"IF(Inmeetformulier!S29=\"\",\"\",Inmeetformulier!S29)","v":""}]
[null,{"$f":"IF(Inmeetformulier!P30=\"\",\"\",Inmeetformulier!P30)","v":""},{"$f":"IF(Inmeetformulier!Q30=\"\",\"\",Inmeetformulier!Q30)","v":""},{"$f":"IF(Inmeetformulier!D30=\"\",\"\",Inmeetformulier!D30)","v":""},{"$f":"IF(Inmeetformulier!E30=\"\",\"\",Inmeetformulier!E30)","v":""},{"$f":"IF(Inmeetformulier!F30=\"\",\"\",Inmeetformulier!F30)","v":""},{"$f":"IF(Inmeetformulier!G30=\"\",\"\",Inmeetformulier!G30)","v":""},{"$f":"IF(Inmeetformulier!H30=\"\",\"\",Inmeetformulier!H30)","v":""},{"$f":"IF(Inmeetformulier!I30=\"\",\"\",Inmeetformulier!I30)","v":""},{"$f":"IF(Inmeetformulier!J30=\"\",\"\",Inmeetformulier!J30)","v":""},{"$f":"IF(Inmeetformulier!K30=\"\",\"\",Inmeetformulier!K30)","v":""},{"$f":"IF(Inmeetformulier!L30=\"\",\"\",Inmeetformulier!L30)","v":""},{"$f":"IF(Inmeetformulier!M30=\"\",\"\",Inmeetformulier!M30)","v":""},{"$f":"IF(Inmeetformulier!N30=\"\",\"\",Inmeetformulier!N30)","v":""},{"$f":"IF(Inmeetformulier!O30=\"\",\"\",Inmeetformulier!O30)","v":""},{"$f":"IF(Inmeetformulier!B30=\"\",\"\",Inmeetformulier!B30)","v":""},{"$f":"IF(Inmeetformulier!S30=\"\",\"\",Inmeetformulier!S30)","v":""}]
[null,{"$f":"IF(Inmeetformulier!P31=\"\",\"\",Inmeetformulier!P31)","v":""},{"$f":"IF(Inmeetformulier!Q31=\"\",\"\",Inmeetformulier!Q31)","v":""},{"$f":"IF(Inmeetformulier!D31=\"\",\"\",Inmeetformulier!D31)","v":""},{"$f":"IF(Inmeetformulier!E31=\"\",\"\",Inmeetformulier!E31)","v":""},{"$f":"IF(Inmeetformulier!F31=\"\",\"\",Inmeetformulier!F31)","v":""},{"$f":"IF(Inmeetformulier!G31=\"\",\"\",Inmeetformulier!G31)","v":""},{"$f":"IF(Inmeetformulier!H31=\"\",\"\",Inmeetformulier!H31)","v":""},{"$f":"IF(Inmeetformulier!I31=\"\",\"\",Inmeetformulier!I31)","v":""},{"$f":"IF(Inmeetformulier!J31=\"\",\"\",Inmeetformulier!J31)","v":""},{"$f":"IF(Inmeetformulier!K31=\"\",\"\",Inmeetformulier!K31)","v":""},{"$f":"IF(Inmeetformulier!L31=\"\",\"\",Inmeetformulier!L31)","v":""},{"$f":"IF(Inmeetformulier!M31=\"\",\"\",Inmeetformulier!M31)","v":""},{"$f":"IF(Inmeetformulier!N31=\"\",\"\",Inmeetformulier!N31)","v":""},{"$f":"IF(Inmeetformulier!O31=\"\",\"\",Inmeetformulier!O31)","v":""},{"$f":"IF(Inmeetformulier!B31=\"\",\"\",Inmeetformulier!B31)","v":""},{"$f":"IF(Inmeetformulier!S31=\"\",\"\",Inmeetformulier!S31)","v":""}]
[null,{"$f":"IF(Inmeetformulier!P32=\"\",\"\",Inmeetformulier!P32)","v":""},{"$f":"IF(Inmeetformulier!Q32=\"\",\"\",Inmeetformulier!Q32)","v":""},{"$f":"IF(Inmeetformulier!D32=\"\",\"\",Inmeetformulier!D32)","v":""},{"$f":"IF(Inmeetformulier!E32=\"\",\"\",Inmeetformulier!E32)","v":""},{"$f":"IF(Inmeetformulier!F32=\"\",\"\",Inmeetformulier!F32)","v":""},{"$f":"IF(Inmeetformulier!G32=\"\",\"\",Inmeetformulier!G32)","v":""},{"$f":"IF(Inmeetformulier!H32=\"\",\"\",Inmeetformulier!H32)","v":""},{"$f":"IF(Inmeetformulier!I32=\"\",\"\",Inmeetformulier!I32)","v":""},{"$f":"IF(Inmeetformulier!J32=\"\",\"\",Inmeetformulier!J32)","v":""},{"$f":"IF(Inmeetformulier!K32=\"\",\"\",Inmeetformulier!K32)","v":""},{"$f":"IF(Inmeetformulier!L32=\"\",\"\",Inmeetformulier!L32)","v":""},{"$f":"IF(Inmeetformulier!M32=\"\",\"\",Inmeetformulier!M32)","v":""},{"$f":"IF(Inmeetformulier!N32=\"\",\"\",Inmeetformulier!N32)","v":""},{"$f":"IF(Inmeetformulier!O32=\"\",\"\",Inmeetformulier!O32)","v":""},{"$f":"IF(Inmeetformulier!B32=\"\",\"\",Inmeetformulier!B32)","v":""},{"$f":"IF(Inmeetformulier!S32=\"\",\"\",Inmeetformulier!S32)","v":""}]
[null,{"$f":"IF(Inmeetformulier!P33=\"\",\"\",Inmeetformulier!P33)","v":""},{"$f":"IF(Inmeetformulier!Q33=\"\",\"\",Inmeetformulier!Q33)","v":""},{"$f":"IF(Inmeetformulier!D33=\"\",\"\",Inmeetformulier!D33)","v":""},{"$f":"IF(Inmeetformulier!E33=\"\",\"\",Inmeetformulier!E33)","v":""},{"$f":"IF(Inmeetformulier!F33=\"\",\"\",Inmeetformulier!F33)","v":""},{"$f":"IF(Inmeetformulier!G33=\"\",\"\",Inmeetformulier!G33)","v":""},{"$f":"IF(Inmeetformulier!H33=\"\",\"\",Inmeetformulier!H33)","v":""},{"$f":"IF(Inmeetformulier!I33=\"\",\"\",Inmeetformulier!I33)","v":""},{"$f":"IF(Inmeetformulier!J33=\"\",\"\",Inmeetformulier!J33)","v":""},{"$f":"IF(Inmeetformulier!K33=\"\",\"\",Inmeetformulier!K33)","v":""},{"$f":"IF(Inmeetformulier!L33=\"\",\"\",Inmeetformulier!L33)","v":""},{"$f":"IF(Inmeetformulier!M33=\"\",\"\",Inmeetformulier!M33)","v":""},{"$f":"IF(Inmeetformulier!N33=\"\",\"\",Inmeetformulier!N33)","v":""},{"$f":"IF(Inmeetformulier!O33=\"\",\"\",Inmeetformulier!O33)","v":""},{"$f":"IF(Inmeetformulier!B33=\"\",\"\",Inmeetformulier!B33)","v":""},{"$f":"IF(Inmeetformulier!S33=\"\",\"\",Inmeetformulier!S33)","v":""}]
[null,{"$f":"IF(Inmeetformulier!P34=\"\",\"\",Inmeetformulier!P34)","v":""},{"$f":"IF(Inmeetformulier!Q34=\"\",\"\",Inmeetformulier!Q34)","v":""},{"$f":"IF(Inmeetformulier!D34=\"\",\"\",Inmeetformulier!D34)","v":""},{"$f":"IF(Inmeetformulier!E34=\"\",\"\",Inmeetformulier!E34)","v":""},{"$f":"IF(Inmeetformulier!F34=\"\",\"\",Inmeetformulier!F34)","v":""},{"$f":"IF(Inmeetformulier!G34=\"\",\"\",Inmeetformulier!G34)","v":""},{"$f":"IF(Inmeetformulier!H34=\"\",\"\",Inmeetformulier!H34)","v":""},{"$f":"IF(Inmeetformulier!I34=\"\",\"\",Inmeetformulier!I34)","v":""},{"$f":"IF(Inmeetformulier!J34=\"\",\"\",Inmeetformulier!J34)","v":""},{"$f":"IF(Inmeetformulier!K34=\"\",\"\",Inmeetformulier!K34)","v":""},{"$f":"IF(Inmeetformulier!L34=\"\",\"\",Inmeetformulier!L34)","v":""},{"$f":"IF(Inmeetformulier!M34=\"\",\"\",Inmeetformulier!M34)","v":""},{"$f":"IF(Inmeetformulier!N34=\"\",\"\",Inmeetformulier!N34)","v":""},{"$f":"IF(Inmeetformulier!O34=\"\",\"\",Inmeetformulier!O34)","v":""},{"$f":"IF(Inmeetformulier!B34=\"\",\"\",Inmeetformulier!B34)","v":""},{"$f":"IF(Inmeetformulier!S34=\"\",\"\",Inmeetformulier!S34)","v":""}]
[null,{"$f":"IF(Inmeetformulier!P35=\"\",\"\",Inmeetformulier!P35)","v":""},{"$f":"IF(Inmeetformulier!Q35=\"\",\"\",Inmeetformulier!Q35)","v":""},{"$f":"IF(Inmeetformulier!D35=\"\",\"\",Inmeetformulier!D35)","v":""},{"$f":"IF(Inmeetformulier!E35=\"\",\"\",Inmeetformulier!E35)","v":""},{"$f":"IF(Inmeetformulier!F35=\"\",\"\",Inmeetformulier!F35)","v":""},{"$f":"IF(Inmeetformulier!G35=\"\",\"\",Inmeetformulier!G35)","v":""},{"$f":"IF(Inmeetformulier!H35=\"\",\"\",Inmeetformulier!H35)","v":""},{"$f":"IF(Inmeetformulier!I35=\"\",\"\",Inmeetformulier!I35)","v":""},{"$f":"IF(Inmeetformulier!J35=\"\",\"\",Inmeetformulier!J35)","v":""},{"$f":"IF(Inmeetformulier!K35=\"\",\"\",Inmeetformulier!K35)","v":""},{"$f":"IF(Inmeetformulier!L35=\"\",\"\",Inmeetformulier!L35)","v":""},{"$f":"IF(Inmeetformulier!M35=\"\",\"\",Inmeetformulier!M35)","v":""},{"$f":"IF(Inmeetformulier!N35=\"\",\"\",Inmeetformulier!N35)","v":""},{"$f":"IF(Inmeetformulier!O35=\"\",\"\",Inmeetformulier!O35)","v":""},{"$f":"IF(Inmeetformulier!B35=\"\",\"\",Inmeetformulier!B35)","v":""},{"$f":"IF(Inmeetformulier!S35=\"\",\"\",Inmeetformulier!S35)","v":""}]
[null,{"$f":"IF(Inmeetformulier!P36=\"\",\"\",Inmeetformulier!P36)","v":""},{"$f":"IF(Inmeetformulier!Q36=\"\",\"\",Inmeetformulier!Q36)","v":""},{"$f":"IF(Inmeetformulier!D36=\"\",\"\",Inmeetformulier!D36)","v":""},{"$f":"IF(Inmeetformulier!E36=\"\",\"\",Inmeetformulier!E36)","v":""},{"$f":"IF(Inmeetformulier!F36=\"\",\"\",Inmeetformulier!F36)","v":""},{"$f":"IF(Inmeetformulier!G36=\"\",\"\",Inmeetformulier!G36)","v":""},{"$f":"IF(Inmeetformulier!H36=\"\",\"\",Inmeetformulier!H36)","v":""},{"$f":"IF(Inmeetformulier!I36=\"\",\"\",Inmeetformulier!I36)","v":""},{"$f":"IF(Inmeetformulier!J36=\"\",\"\",Inmeetformulier!J36)","v":""},{"$f":"IF(Inmeetformulier!K36=\"\",\"\",Inmeetformulier!K36)","v":""},{"$f":"IF(Inmeetformulier!L36=\"\",\"\",Inmeetformulier!L36)","v":""},{"$f":"IF(Inmeetformulier!M36=\"\",\"\",Inmeetformulier!M36)","v":""},{"$f":"IF(Inmeetformulier!N36=\"\",\"\",Inmeetformulier!N36)","v":""},{"$f":"IF(Inmeetformulier!O36=\"\",\"\",Inmeetformulier!O36)","v":""},{"$f":"IF(Inmeetformulier!B36=\"\",\"\",Inmeetformulier!B36)","v":""},{"$f":"IF(Inmeetformulier!S36=\"\",\"\",Inmeetformulier!S36)","v":""}]
[null,{"$f":"IF(Inmeetformulier!P37=\"\",\"\",Inmeetformulier!P37)","v":""},{"$f":"IF(Inmeetformulier!Q37=\"\",\"\",Inmeetformulier!Q37)","v":""},{"$f":"IF(Inmeetformulier!D37=\"\",\"\",Inmeetformulier!D37)","v":""},{"$f":"IF(Inmeetformulier!E37=\"\",\"\",Inmeetformulier!E37)","v":""},{"$f":"IF(Inmeetformulier!F37=\"\",\"\",Inmeetformulier!F37)","v":""},{"$f":"IF(Inmeetformulier!G37=\"\",\"\",Inmeetformulier!G37)","v":""},{"$f":"IF(Inmeetformulier!H37=\"\",\"\",Inmeetformulier!H37)","v":""},{"$f":"IF(Inmeetformulier!I37=\"\",\"\",Inmeetformulier!I37)","v":""},{"$f":"IF(Inmeetformulier!J37=\"\",\"\",Inmeetformulier!J37)","v":""},{"$f":"IF(Inmeetformulier!K37=\"\",\"\",Inmeetformulier!K37)","v":""},{"$f":"IF(Inmeetformulier!L37=\"\",\"\",Inmeetformulier!L37)","v":""},{"$f":"IF(Inmeetformulier!M37=\"\",\"\",Inmeetformulier!M37)","v":""},{"$f":"IF(Inmeetformulier!N37=\"\",\"\",Inmeetformulier!N37)","v":""},{"$f":"IF(Inmeetformulier!O37=\"\",\"\",Inmeetformulier!O37)","v":""},{"$f":"IF(Inmeetformulier!B37=\"\",\"\",Inmeetformulier!B37)","v":""},{"$f":"IF(Inmeetformulier!S37=\"\",\"\",Inmeetformulier!S37)","v":""}]
[null,{"$f":"IF(Inmeetformulier!P38=\"\",\"\",Inmeetformulier!P38)","v":""},{"$f":"IF(Inmeetformulier!Q38=\"\",\"\",Inmeetformulier!Q38)","v":""},{"$f":"IF(Inmeetformulier!D38=\"\",\"\",Inmeetformulier!D38)","v":""},{"$f":"IF(Inmeetformulier!E38=\"\",\"\",Inmeetformulier!E38)","v":""},{"$f":"IF(Inmeetformulier!F38=\"\",\"\",Inmeetformulier!F38)","v":""},{"$f":"IF(Inmeetformulier!G38=\"\",\"\",Inmeetformulier!G38)","v":""},{"$f":"IF(Inmeetformulier!H38=\"\",\"\",Inmeetformulier!H38)","v":""},{"$f":"IF(Inmeetformulier!I38=\"\",\"\",Inmeetformulier!I38)","v":""},{"$f":"IF(Inmeetformulier!J38=\"\",\"\",Inmeetformulier!J38)","v":""},{"$f":"IF(Inmeetformulier!K38=\"\",\"\",Inmeetformulier!K38)","v":""},{"$f":"IF(Inmeetformulier!L38=\"\",\"\",Inmeetformulier!L38)","v":""},{"$f":"IF(Inmeetformulier!M38=\"\",\"\",Inmeetformulier!M38)","v":""},{"$f":"IF(Inmeetformulier!N38=\"\",\"\",Inmeetformulier!N38)","v":""},{"$f":"IF(Inmeetformulier!O38=\"\",\"\",Inmeetformulier!O38)","v":""},{"$f":"IF(Inmeetformulier!B38=\"\",\"\",Inmeetformulier!B38)","v":""},{"$f":"IF(Inmeetformulier!S38=\"\",\"\",Inmeetformulier!S38)","v":""}]
[null,{"$f":"IF(Inmeetformulier!P39=\"\",\"\",Inmeetformulier!P39)","v":""},{"$f":"IF(Inmeetformulier!Q39=\"\",\"\",Inmeetformulier!Q39)","v":""},{"$f":"IF(Inmeetformulier!D39=\"\",\"\",Inmeetformulier!D39)","v":""},{"$f":"IF(Inmeetformulier!E39=\"\",\"\",Inmeetformulier!E39)","v":""},{"$f":"IF(Inmeetformulier!F39=\"\",\"\",Inmeetformulier!F39)","v":""},{"$f":"IF(Inmeetformulier!G39=\"\",\"\",Inmeetformulier!G39)","v":""},{"$f":"IF(Inmeetformulier!H39=\"\",\"\",Inmeetformulier!H39)","v":""},{"$f":"IF(Inmeetformulier!I39=\"\",\"\",Inmeetformulier!I39)","v":""},{"$f":"IF(Inmeetformulier!J39=\"\",\"\",Inmeetformulier!J39)","v":""},{"$f":"IF(Inmeetformulier!K39=\"\",\"\",Inmeetformulier!K39)","v":""},{"$f":"IF(Inmeetformulier!L39=\"\",\"\",Inmeetformulier!L39)","v":""},{"$f":"IF(Inmeetformulier!M39=\"\",\"\",Inmeetformulier!M39)","v":""},{"$f":"IF(Inmeetformulier!N39=\"\",\"\",Inmeetformulier!N39)","v":""},{"$f":"IF(Inmeetformulier!O39=\"\",\"\",Inmeetformulier!O39)","v":""},{"$f":"IF(Inmeetformulier!B39=\"\",\"\",Inmeetformulier!B39)","v":""},{"$f":"IF(Inmeetformulier!S39=\"\",\"\",Inmeetformulier!S39)","v":""}]
[null,{"$f":"IF(Inmeetformulier!P40=\"\",\"\",Inmeetformulier!P40)","v":""},{"$f":"IF(Inmeetformulier!Q40=\"\",\"\",Inmeetformulier!Q40)","v":""},{"$f":"IF(Inmeetformulier!D40=\"\",\"\",Inmeetformulier!D40)","v":""},{"$f":"IF(Inmeetformulier!E40=\"\",\"\",Inmeetformulier!E40)","v":""},{"$f":"IF(Inmeetformulier!F40=\"\",\"\",Inmeetformulier!F40)","v":""},{"$f":"IF(Inmeetformulier!G40=\"\",\"\",Inmeetformulier!G40)","v":""},{"$f":"IF(Inmeetformulier!H40=\"\",\"\",Inmeetformulier!H40)","v":""},{"$f":"IF(Inmeetformulier!I40=\"\",\"\",Inmeetformulier!I40)","v":""},{"$f":"IF(Inmeetformulier!J40=\"\",\"\",Inmeetformulier!J40)","v":""},{"$f":"IF(Inmeetformulier!K40=\"\",\"\",Inmeetformulier!K40)","v":""},{"$f":"IF(Inmeetformulier!L40=\"\",\"\",Inmeetformulier!L40)","v":""},{"$f":"IF(Inmeetformulier!M40=\"\",\"\",Inmeetformulier!M40)","v":""},{"$f":"IF(Inmeetformulier!N40=\"\",\"\",Inmeetformulier!N40)","v":""},{"$f":"IF(Inmeetformulier!O40=\"\",\"\",Inmeetformulier!O40)","v":""},{"$f":"IF(Inmeetformulier!B40=\"\",\"\",Inmeetformulier!B40)","v":""},{"$f":"IF(Inmeetformulier!S40=\"\",\"\",Inmeetformulier!S40)","v":""}]
[null,{"$f":"IF(Inmeetformulier!P41=\"\",\"\",Inmeetformulier!P41)","v":""},{"$f":"IF(Inmeetformulier!Q41=\"\",\"\",Inmeetformulier!Q41)","v":""},{"$f":"IF(Inmeetformulier!D41=\"\",\"\",Inmeetformulier!D41)","v":""},{"$f":"IF(Inmeetformulier!E41=\"\",\"\",Inmeetformulier!E41)","v":""},{"$f":"IF(Inmeetformulier!F41=\"\",\"\",Inmeetformulier!F41)","v":""},{"$f":"IF(Inmeetformulier!G41=\"\",\"\",Inmeetformulier!G41)","v":""},{"$f":"IF(Inmeetformulier!H41=\"\",\"\",Inmeetformulier!H41)","v":""},{"$f":"IF(Inmeetformulier!I41=\"\",\"\",Inmeetformulier!I41)","v":""},{"$f":"IF(Inmeetformulier!J41=\"\",\"\",Inmeetformulier!J41)","v":""},{"$f":"IF(Inmeetformulier!K41=\"\",\"\",Inmeetformulier!K41)","v":""},{"$f":"IF(Inmeetformulier!L41=\"\",\"\",Inmeetformulier!L41)","v":""},{"$f":"IF(Inmeetformulier!M41=\"\",\"\",Inmeetformulier!M41)","v":""},{"$f":"IF(Inmeetformulier!N41=\"\",\"\",Inmeetformulier!N41)","v":""},{"$f":"IF(Inmeetformulier!O41=\"\",\"\",Inmeetformulier!O41)","v":""},{"$f":"IF(Inmeetformulier!B41=\"\",\"\",Inmeetformulier!B41)","v":""},{"$f":"IF(Inmeetformulier!S41=\"\",\"\",Inmeetformulier!S41)","v":""}]
[null,{"$f":"IF(Inmeetformulier!P42=\"\",\"\",Inmeetformulier!P42)","v":""},{"$f":"IF(Inmeetformulier!Q42=\"\",\"\",Inmeetformulier!Q42)","v":""},{"$f":"IF(Inmeetformulier!D42=\"\",\"\",Inmeetformulier!D42)","v":""},{"$f":"IF(Inmeetformulier!E42=\"\",\"\",Inmeetformulier!E42)","v":""},{"$f":"IF(Inmeetformulier!F42=\"\",\"\",Inmeetformulier!F42)","v":""},{"$f":"IF(Inmeetformulier!G42=\"\",\"\",Inmeetformulier!G42)","v":""},{"$f":"IF(Inmeetformulier!H42=\"\",\"\",Inmeetformulier!H42)","v":""},{"$f":"IF(Inmeetformulier!I42=\"\",\"\",Inmeetformulier!I42)","v":""},{"$f":"IF(Inmeetformulier!J42=\"\",\"\",Inmeetformulier!J42)","v":""},{"$f":"IF(Inmeetformulier!K42=\"\",\"\",Inmeetformulier!K42)","v":""},{"$f":"IF(Inmeetformulier!L42=\"\",\"\",Inmeetformulier!L42)","v":""},{"$f":"IF(Inmeetformulier!M42=\"\",\"\",Inmeetformulier!M42)","v":""},{"$f":"IF(Inmeetformulier!N42=\"\",\"\",Inmeetformulier!N42)","v":""},{"$f":"IF(Inmeetformulier!O42=\"\",\"\",Inmeetformulier!O42)","v":""},{"$f":"IF(Inmeetformulier!B42=\"\",\"\",Inmeetformulier!B42)","v":""},{"$f":"IF(Inmeetformulier!S42=\"\",\"\",Inmeetformulier!S42)","v":""}]
[null,{"$f":"IF(Inmeetformulier!P43=\"\",\"\",Inmeetformulier!P43)","v":""},{"$f":"IF(Inmeetformulier!Q43=\"\",\"\",Inmeetformulier!Q43)","v":""},{"$f":"IF(Inmeetformulier!D43=\"\",\"\",Inmeetformulier!D43)","v":""},{"$f":"IF(Inmeetformulier!E43=\"\",\"\",Inmeetformulier!E43)","v":""},{"$f":"IF(Inmeetformulier!F43=\"\",\"\",Inmeetformulier!F43)","v":""},{"$f":"IF(Inmeetformulier!G43=\"\",\"\",Inmeetformulier!G43)","v":""},{"$f":"IF(Inmeetformulier!H43=\"\",\"\",Inmeetformulier!H43)","v":""},{"$f":"IF(Inmeetformulier!I43=\"\",\"\",Inmeetformulier!I43)","v":""},{"$f":"IF(Inmeetformulier!J43=\"\",\"\",Inmeetformulier!J43)","v":""},{"$f":"IF(Inmeetformulier!K43=\"\",\"\",Inmeetformulier!K43)","v":""},{"$f":"IF(Inmeetformulier!L43=\"\",\"\",Inmeetformulier!L43)","v":""},{"$f":"IF(Inmeetformulier!M43=\"\",\"\",Inmeetformulier!M43)","v":""},{"$f":"IF(Inmeetformulier!N43=\"\",\"\",Inmeetformulier!N43)","v":""},{"$f":"IF(Inmeetformulier!O43=\"\",\"\",Inmeetformulier!O43)","v":""},{"$f":"IF(Inmeetformulier!B43=\"\",\"\",Inmeetformulier!B43)","v":""},{"$f":"IF(Inmeetformulier!S43=\"\",\"\",Inmeetformulier!S43)","v":""}]
[null,{"$f":"IF(Inmeetformulier!P44=\"\",\"\",Inmeetformulier!P44)","v":""},{"$f":"IF(Inmeetformulier!Q44=\"\",\"\",Inmeetformulier!Q44)","v":""},{"$f":"IF(Inmeetformulier!D44=\"\",\"\",Inmeetformulier!D44)","v":""},{"$f":"IF(Inmeetformulier!E44=\"\",\"\",Inmeetformulier!E44)","v":""},{"$f":"IF(Inmeetformulier!F44=\"\",\"\",Inmeetformulier!F44)","v":""},{"$f":"IF(Inmeetformulier!G44=\"\",\"\",Inmeetformulier!G44)","v":""},{"$f":"IF(Inmeetformulier!H44=\"\",\"\",Inmeetformulier!H44)","v":""},{"$f":"IF(Inmeetformulier!I44=\"\",\"\",Inmeetformulier!I44)","v":""},{"$f":"IF(Inmeetformulier!J44=\"\",\"\",Inmeetformulier!J44)","v":""},{"$f":"IF(Inmeetformulier!K44=\"\",\"\",Inmeetformulier!K44)","v":""},{"$f":"IF(Inmeetformulier!L44=\"\",\"\",Inmeetformulier!L44)","v":""},{"$f":"IF(Inmeetformulier!M44=\"\",\"\",Inmeetformulier!M44)","v":""},{"$f":"IF(Inmeetformulier!N44=\"\",\"\",Inmeetformulier!N44)","v":""},{"$f":"IF(Inmeetformulier!O44=\"\",\"\",Inmeetformulier!O44)","v":""},{"$f":"IF(Inmeetformulier!B44=\"\",\"\",Inmeetformulier!B44)","v":""},{"$f":"IF(Inmeetformulier!S44=\"\",\"\",Inmeetformulier!S44)","v":""}]
[null,{"$f":"IF(Inmeetformulier!P45=\"\",\"\",Inmeetformulier!P45)","v":""},{"$f":"IF(Inmeetformulier!Q45=\"\",\"\",Inmeetformulier!Q45)","v":""},{"$f":"IF(Inmeetformulier!D45=\"\",\"\",Inmeetformulier!D45)","v":""},{"$f":"IF(Inmeetformulier!E45=\"\",\"\",Inmeetformulier!E45)","v":""},{"$f":"IF(Inmeetformulier!F45=\"\",\"\",Inmeetformulier!F45)","v":""},{"$f":"IF(Inmeetformulier!G45=\"\",\"\",Inmeetformulier!G45)","v":""},{"$f":"IF(Inmeetformulier!H45=\"\",\"\",Inmeetformulier!H45)","v":""},{"$f":"IF(Inmeetformulier!I45=\"\",\"\",Inmeetformulier!I45)","v":""},{"$f":"IF(Inmeetformulier!J45=\"\",\"\",Inmeetformulier!J45)","v":""},{"$f":"IF(Inmeetformulier!K45=\"\",\"\",Inmeetformulier!K45)","v":""},{"$f":"IF(Inmeetformulier!L45=\"\",\"\",Inmeetformulier!L45)","v":""},{"$f":"IF(Inmeetformulier!M45=\"\",\"\",Inmeetformulier!M45)","v":""},{"$f":"IF(Inmeetformulier!N45=\"\",\"\",Inmeetformulier!N45)","v":""},{"$f":"IF(Inmeetformulier!O45=\"\",\"\",Inmeetformulier!O45)","v":""},{"$f":"IF(Inmeetformulier!B45=\"\",\"\",Inmeetformulier!B45)","v":""},{"$f":"IF(Inmeetformulier!S45=\"\",\"\",Inmeetformulier!S45)","v":""}]
[null,{"$f":"IF(Inmeetformulier!P46=\"\",\"\",Inmeetformulier!P46)","v":""},{"$f":"IF(Inmeetformulier!Q46=\"\",\"\",Inmeetformulier!Q46)","v":""},{"$f":"IF(Inmeetformulier!D46=\"\",\"\",Inmeetformulier!D46)","v":""},{"$f":"IF(Inmeetformulier!E46=\"\",\"\",Inmeetformulier!E46)","v":""},{"$f":"IF(Inmeetformulier!F46=\"\",\"\",Inmeetformulier!F46)","v":""},{"$f":"IF(Inmeetformulier!G46=\"\",\"\",Inmeetformulier!G46)","v":""},{"$f":"IF(Inmeetformulier!H46=\"\",\"\",Inmeetformulier!H46)","v":""},{"$f":"IF(Inmeetformulier!I46=\"\",\"\",Inmeetformulier!I46)","v":""},{"$f":"IF(Inmeetformulier!J46=\"\",\"\",Inmeetformulier!J46)","v":""},{"$f":"IF(Inmeetformulier!K46=\"\",\"\",Inmeetformulier!K46)","v":""},{"$f":"IF(Inmeetformulier!L46=\"\",\"\",Inmeetformulier!L46)","v":""},{"$f":"IF(Inmeetformulier!M46=\"\",\"\",Inmeetformulier!M46)","v":""},{"$f":"IF(Inmeetformulier!N46=\"\",\"\",Inmeetformulier!N46)","v":""},{"$f":"IF(Inmeetformulier!O46=\"\",\"\",Inmeetformulier!O46)","v":""},{"$f":"IF(Inmeetformulier!B46=\"\",\"\",Inmeetformulier!B46)","v":""},{"$f":"IF(Inmeetformulier!S46=\"\",\"\",Inmeetformulier!S46)","v":""}]
[null,{"$f":"IF(Inmeetformulier!P47=\"\",\"\",Inmeetformulier!P47)","v":""},{"$f":"IF(Inmeetformulier!Q47=\"\",\"\",Inmeetformulier!Q47)","v":""},{"$f":"IF(Inmeetformulier!D47=\"\",\"\",Inmeetformulier!D47)","v":""},{"$f":"IF(Inmeetformulier!E47=\"\",\"\",Inmeetformulier!E47)","v":""},{"$f":"IF(Inmeetformulier!F47=\"\",\"\",Inmeetformulier!F47)","v":""},{"$f":"IF(Inmeetformulier!G47=\"\",\"\",Inmeetformulier!G47)","v":""},{"$f":"IF(Inmeetformulier!H47=\"\",\"\",Inmeetformulier!H47)","v":""},{"$f":"IF(Inmeetformulier!I47=\"\",\"\",Inmeetformulier!I47)","v":""},{"$f":"IF(Inmeetformulier!J47=\"\",\"\",Inmeetformulier!J47)","v":""},{"$f":"IF(Inmeetformulier!K47=\"\",\"\",Inmeetformulier!K47)","v":""},{"$f":"IF(Inmeetformulier!L47=\"\",\"\",Inmeetformulier!L47)","v":""},{"$f":"IF(Inmeetformulier!M47=\"\",\"\",Inmeetformulier!M47)","v":""},{"$f":"IF(Inmeetformulier!N47=\"\",\"\",Inmeetformulier!N47)","v":""},{"$f":"IF(Inmeetformulier!O47=\"\",\"\",Inmeetformulier!O47)","v":""},{"$f":"IF(Inmeetformulier!B47=\"\",\"\",Inmeetformulier!B47)","v":""},{"$f":"IF(Inmeetformulier!S47=\"\",\"\",Inmeetformulier!S47)","v":""}]
[null,{"$f":"IF(Inmeetformulier!P48=\"\",\"\",Inmeetformulier!P48)","v":""},{"$f":"IF(Inmeetformulier!Q48=\"\",\"\",Inmeetformulier!Q48)","v":""},{"$f":"IF(Inmeetformulier!D48=\"\",\"\",Inmeetformulier!D48)","v":""},{"$f":"IF(Inmeetformulier!E48=\"\",\"\",Inmeetformulier!E48)","v":""},{"$f":"IF(Inmeetformulier!F48=\"\",\"\",Inmeetformulier!F48)","v":""},{"$f":"IF(Inmeetformulier!G48=\"\",\"\",Inmeetformulier!G48)","v":""},{"$f":"IF(Inmeetformulier!H48=\"\",\"\",Inmeetformulier!H48)","v":""},{"$f":"IF(Inmeetformulier!I48=\"\",\"\",Inmeetformulier!I48)","v":""},{"$f":"IF(Inmeetformulier!J48=\"\",\"\",Inmeetformulier!J48)","v":""},{"$f":"IF(Inmeetformulier!K48=\"\",\"\",Inmeetformulier!K48)","v":""},{"$f":"IF(Inmeetformulier!L48=\"\",\"\",Inmeetformulier!L48)","v":""},{"$f":"IF(Inmeetformulier!M48=\"\",\"\",Inmeetformulier!M48)","v":""},{"$f":"IF(Inmeetformulier!N48=\"\",\"\",Inmeetformulier!N48)","v":""},{"$f":"IF(Inmeetformulier!O48=\"\",\"\",Inmeetformulier!O48)","v":""},{"$f":"IF(Inmeetformulier!B48=\"\",\"\",Inmeetformulier!B48)","v":""},{"$f":"IF(Inmeetformulier!S48=\"\",\"\",Inmeetformulier!S48)","v":""}]
[null,{"$f":"IF(Inmeetformulier!P49=\"\",\"\",Inmeetformulier!P49)","v":""},{"$f":"IF(Inmeetformulier!Q49=\"\",\"\",Inmeetformulier!Q49)","v":""},{"$f":"IF(Inmeetformulier!D49=\"\",\"\",Inmeetformulier!D49)","v":""},{"$f":"IF(Inmeetformulier!E49=\"\",\"\",Inmeetformulier!E49)","v":""},{"$f":"IF(Inmeetformulier!F49=\"\",\"\",Inmeetformulier!F49)","v":""},{"$f":"IF(Inmeetformulier!G49=\"\",\"\",Inmeetformulier!G49)","v":""},{"$f":"IF(Inmeetformulier!H49=\"\",\"\",Inmeetformulier!H49)","v":""},{"$f":"IF(Inmeetformulier!I49=\"\",\"\",Inmeetformulier!I49)","v":""},{"$f":"IF(Inmeetformulier!J49=\"\",\"\",Inmeetformulier!J49)","v":""},{"$f":"IF(Inmeetformulier!K49=\"\",\"\",Inmeetformulier!K49)","v":""},{"$f":"IF(Inmeetformulier!L49=\"\",\"\",Inmeetformulier!L49)","v":""},{"$f":"IF(Inmeetformulier!M49=\"\",\"\",Inmeetformulier!M49)","v":""},{"$f":"IF(Inmeetformulier!N49=\"\",\"\",Inmeetformulier!N49)","v":""},{"$f":"IF(Inmeetformulier!O49=\"\",\"\",Inmeetformulier!O49)","v":""},{"$f":"IF(Inmeetformulier!B49=\"\",\"\",Inmeetformulier!B49)","v":""},{"$f":"IF(Inmeetformulier!S49=\"\",\"\",Inmeetformulier!S49)","v":""}]
[null,{"$f":"IF(Inmeetformulier!P50=\"\",\"\",Inmeetformulier!P50)","v":""},{"$f":"IF(Inmeetformulier!Q50=\"\",\"\",Inmeetformulier!Q50)","v":""},{"$f":"IF(Inmeetformulier!D50=\"\",\"\",Inmeetformulier!D50)","v":""},{"$f":"IF(Inmeetformulier!E50=\"\",\"\",Inmeetformulier!E50)","v":""},{"$f":"IF(Inmeetformulier!F50=\"\",\"\",Inmeetformulier!F50)","v":""},{"$f":"IF(Inmeetformulier!G50=\"\",\"\",Inmeetformulier!G50)","v":""},{"$f":"IF(Inmeetformulier!H50=\"\",\"\",Inmeetformulier!H50)","v":""},{"$f":"IF(Inmeetformulier!I50=\"\",\"\",Inmeetformulier!I50)","v":""},{"$f":"IF(Inmeetformulier!J50=\"\",\"\",Inmeetformulier!J50)","v":""},{"$f":"IF(Inmeetformulier!K50=\"\",\"\",Inmeetformulier!K50)","v":""},{"$f":"IF(Inmeetformulier!L50=\"\",\"\",Inmeetformulier!L50)","v":""},{"$f":"IF(Inmeetformulier!M50=\"\",\"\",Inmeetformulier!M50)","v":""},{"$f":"IF(Inmeetformulier!N50=\"\",\"\",Inmeetformulier!N50)","v":""},{"$f":"IF(Inmeetformulier!O50=\"\",\"\",Inmeetformulier!O50)","v":""},{"$f":"IF(Inmeetformulier!B50=\"\",\"\",Inmeetformulier!B50)","v":""},{"$f":"IF(Inmeetformulier!S50=\"\",\"\",Inmeetformulier!S50)","v":""}]
[null,{"$f":"IF(Inmeetformulier!P51=\"\",\"\",Inmeetformulier!P51)","v":""},{"$f":"IF(Inmeetformulier!Q51=\"\",\"\",Inmeetformulier!Q51)","v":""},{"$f":"IF(Inmeetformulier!D51=\"\",\"\",Inmeetformulier!D51)","v":""},{"$f":"IF(Inmeetformulier!E51=\"\",\"\",Inmeetformulier!E51)","v":""},{"$f":"IF(Inmeetformulier!F51=\"\",\"\",Inmeetformulier!F51)","v":""},{"$f":"IF(Inmeetformulier!G51=\"\",\"\",Inmeetformulier!G51)","v":""},{"$f":"IF(Inmeetformulier!H51=\"\",\"\",Inmeetformulier!H51)","v":""},{"$f":"IF(Inmeetformulier!I51=\"\",\"\",Inmeetformulier!I51)","v":""},{"$f":"IF(Inmeetformulier!J51=\"\",\"\",Inmeetformulier!J51)","v":""},{"$f":"IF(Inmeetformulier!K51=\"\",\"\",Inmeetformulier!K51)","v":""},{"$f":"IF(Inmeetformulier!L51=\"\",\"\",Inmeetformulier!L51)","v":""},{"$f":"IF(Inmeetformulier!M51=\"\",\"\",Inmeetformulier!M51)","v":""},{"$f":"IF(Inmeetformulier!N51=\"\",\"\",Inmeetformulier!N51)","v":""},{"$f":"IF(Inmeetformulier!O51=\"\",\"\",Inmeetformulier!O51)","v":""},{"$f":"IF(Inmeetformulier!B51=\"\",\"\",Inmeetformulier!B51)","v":""},{"$f":"IF(Inmeetformulier!S51=\"\",\"\",Inmeetformulier!S51)","v":""}]
[null,{"$f":"IF(Inmeetformulier!P52=\"\",\"\",Inmeetformulier!P52)","v":""},{"$f":"IF(Inmeetformulier!Q52=\"\",\"\",Inmeetformulier!Q52)","v":""},{"$f":"IF(Inmeetformulier!D52=\"\",\"\",Inmeetformulier!D52)","v":""},{"$f":"IF(Inmeetformulier!E52=\"\",\"\",Inmeetformulier!E52)","v":""},{"$f":"IF(Inmeetformulier!F52=\"\",\"\",Inmeetformulier!F52)","v":""},{"$f":"IF(Inmeetformulier!G52=\"\",\"\",Inmeetformulier!G52)","v":""},{"$f":"IF(Inmeetformulier!H52=\"\",\"\",Inmeetformulier!H52)","v":""},{"$f":"IF(Inmeetformulier!I52=\"\",\"\",Inmeetformulier!I52)","v":""},{"$f":"IF(Inmeetformulier!J52=\"\",\"\",Inmeetformulier!J52)","v":""},{"$f":"IF(Inmeetformulier!K52=\"\",\"\",Inmeetformulier!K52)","v":""},{"$f":"IF(Inmeetformulier!L52=\"\",\"\",Inmeetformulier!L52)","v":""},{"$f":"IF(Inmeetformulier!M52=\"\",\"\",Inmeetformulier!M52)","v":""},{"$f":"IF(Inmeetformulier!N52=\"\",\"\",Inmeetformulier!N52)","v":""},{"$f":"IF(Inmeetformulier!O52=\"\",\"\",Inmeetformulier!O52)","v":""},{"$f":"IF(Inmeetformulier!B52=\"\",\"\",Inmeetformulier!B52)","v":""},{"$f":"IF(Inmeetformulier!S52=\"\",\"\",Inmeetformulier!S52)","v":""}]
[null,{"$f":"IF(Inmeetformulier!P53=\"\",\"\",Inmeetformulier!P53)","v":""},{"$f":"IF(Inmeetformulier!Q53=\"\",\"\",Inmeetformulier!Q53)","v":""},{"$f":"IF(Inmeetformulier!D53=\"\",\"\",Inmeetformulier!D53)","v":""},{"$f":"IF(Inmeetformulier!E53=\"\",\"\",Inmeetformulier!E53)","v":""},{"$f":"IF(Inmeetformulier!F53=\"\",\"\",Inmeetformulier!F53)","v":""},{"$f":"IF(Inmeetformulier!G53=\"\",\"\",Inmeetformulier!G53)","v":""},{"$f":"IF(Inmeetformulier!H53=\"\",\"\",Inmeetformulier!H53)","v":""},{"$f":"IF(Inmeetformulier!I53=\"\",\"\",Inmeetformulier!I53)","v":""},{"$f":"IF(Inmeetformulier!J53=\"\",\"\",Inmeetformulier!J53)","v":""},{"$f":"IF(Inmeetformulier!K53=\"\",\"\",Inmeetformulier!K53)","v":""},{"$f":"IF(Inmeetformulier!L53=\"\",\"\",Inmeetformulier!L53)","v":""},{"$f":"IF(Inmeetformulier!M53=\"\",\"\",Inmeetformulier!M53)","v":""},{"$f":"IF(Inmeetformulier!N53=\"\",\"\",Inmeetformulier!N53)","v":""},{"$f":"IF(Inmeetformulier!O53=\"\",\"\",Inmeetformulier!O53)","v":""},{"$f":"IF(Inmeetformulier!B53=\"\",\"\",Inmeetformulier!B53)","v":""},{"$f":"IF(Inmeetformulier!S53=\"\",\"\",Inmeetformulier!S53)","v":""}]
[null,{"$f":"IF(Inmeetformulier!P54=\"\",\"\",Inmeetformulier!P54)","v":""},{"$f":"IF(Inmeetformulier!Q54=\"\",\"\",Inmeetformulier!Q54)","v":""},{"$f":"IF(Inmeetformulier!D54=\"\",\"\",Inmeetformulier!D54)","v":""},{"$f":"IF(Inmeetformulier!E54=\"\",\"\",Inmeetformulier!E54)","v":""},{"$f":"IF(Inmeetformulier!F54=\"\",\"\",Inmeetformulier!F54)","v":""},{"$f":"IF(Inmeetformulier!G54=\"\",\"\",Inmeetformulier!G54)","v":""},{"$f":"IF(Inmeetformulier!H54=\"\",\"\",Inmeetformulier!H54)","v":""},{"$f":"IF(Inmeetformulier!I54=\"\",\"\",Inmeetformulier!I54)","v":""},{"$f":"IF(Inmeetformulier!J54=\"\",\"\",Inmeetformulier!J54)","v":""},{"$f":"IF(Inmeetformulier!K54=\"\",\"\",Inmeetformulier!K54)","v":""},{"$f":"IF(Inmeetformulier!L54=\"\",\"\",Inmeetformulier!L54)","v":""},{"$f":"IF(Inmeetformulier!M54=\"\",\"\",Inmeetformulier!M54)","v":""},{"$f":"IF(Inmeetformulier!N54=\"\",\"\",Inmeetformulier!N54)","v":""},{"$f":"IF(Inmeetformulier!O54=\"\",\"\",Inmeetformulier!O54)","v":""},{"$f":"IF(Inmeetformulier!B54=\"\",\"\",Inmeetformulier!B54)","v":""},{"$f":"IF(Inmeetformulier!S54=\"\",\"\",Inmeetformulier!S54)","v":""}]
[null,{"$f":"IF(Inmeetformulier!P55=\"\",\"\",Inmeetformulier!P55)","v":""},{"$f":"IF(Inmeetformulier!Q55=\"\",\"\",Inmeetformulier!Q55)","v":""},{"$f":"IF(Inmeetformulier!D55=\"\",\"\",Inmeetformulier!D55)","v":""},{"$f":"IF(Inmeetformulier!E55=\"\",\"\",Inmeetformulier!E55)","v":""},{"$f":"IF(Inmeetformulier!F55=\"\",\"\",Inmeetformulier!F55)","v":""},{"$f":"IF(Inmeetformulier!G55=\"\",\"\",Inmeetformulier!G55)","v":""},{"$f":"IF(Inmeetformulier!H55=\"\",\"\",Inmeetformulier!H55)","v":""},{"$f":"IF(Inmeetformulier!I55=\"\",\"\",Inmeetformulier!I55)","v":""},{"$f":"IF(Inmeetformulier!J55=\"\",\"\",Inmeetformulier!J55)","v":""},{"$f":"IF(Inmeetformulier!K55=\"\",\"\",Inmeetformulier!K55)","v":""},{"$f":"IF(Inmeetformulier!L55=\"\",\"\",Inmeetformulier!L55)","v":""},{"$f":"IF(Inmeetformulier!M55=\"\",\"\",Inmeetformulier!M55)","v":""},{"$f":"IF(Inmeetformulier!N55=\"\",\"\",Inmeetformulier!N55)","v":""},{"$f":"IF(Inmeetformulier!O55=\"\",\"\",Inmeetformulier!O55)","v":""},{"$f":"IF(Inmeetformulier!B55=\"\",\"\",Inmeetformulier!B55)","v":""},{"$f":"IF(Inmeetformulier!S55=\"\",\"\",Inmeetformulier!S55)","v":""}]
[null,{"$f":"IF(Inmeetformulier!P56=\"\",\"\",Inmeetformulier!P56)","v":""},{"$f":"IF(Inmeetformulier!Q56=\"\",\"\",Inmeetformulier!Q56)","v":""},{"$f":"IF(Inmeetformulier!D56=\"\",\"\",Inmeetformulier!D56)","v":""},{"$f":"IF(Inmeetformulier!E56=\"\",\"\",Inmeetformulier!E56)","v":""},{"$f":"IF(Inmeetformulier!F56=\"\",\"\",Inmeetformulier!F56)","v":""},{"$f":"IF(Inmeetformulier!G56=\"\",\"\",Inmeetformulier!G56)","v":""},{"$f":"IF(Inmeetformulier!H56=\"\",\"\",Inmeetformulier!H56)","v":""},{"$f":"IF(Inmeetformulier!I56=\"\",\"\",Inmeetformulier!I56)","v":""},{"$f":"IF(Inmeetformulier!J56=\"\",\"\",Inmeetformulier!J56)","v":""},{"$f":"IF(Inmeetformulier!K56=\"\",\"\",Inmeetformulier!K56)","v":""},{"$f":"IF(Inmeetformulier!L56=\"\",\"\",Inmeetformulier!L56)","v":""},{"$f":"IF(Inmeetformulier!M56=\"\",\"\",Inmeetformulier!M56)","v":""},{"$f":"IF(Inmeetformulier!N56=\"\",\"\",Inmeetformulier!N56)","v":""},{"$f":"IF(Inmeetformulier!O56=\"\",\"\",Inmeetformulier!O56)","v":""},{"$f":"IF(Inmeetformulier!B56=\"\",\"\",Inmeetformulier!B56)","v":""},{"$f":"IF(Inmeetformulier!S56=\"\",\"\",Inmeetformulier!S56)","v":""}]
[null,{"$f":"IF(Inmeetformulier!P57=\"\",\"\",Inmeetformulier!P57)","v":""},{"$f":"IF(Inmeetformulier!Q57=\"\",\"\",Inmeetformulier!Q57)","v":""},{"$f":"IF(Inmeetformulier!D57=\"\",\"\",Inmeetformulier!D57)","v":""},{"$f":"IF(Inmeetformulier!E57=\"\",\"\",Inmeetformulier!E57)","v":""},{"$f":"IF(Inmeetformulier!F57=\"\",\"\",Inmeetformulier!F57)","v":""},{"$f":"IF(Inmeetformulier!G57=\"\",\"\",Inmeetformulier!G57)","v":""},{"$f":"IF(Inmeetformulier!H57=\"\",\"\",Inmeetformulier!H57)","v":""},{"$f":"IF(Inmeetformulier!I57=\"\",\"\",Inmeetformulier!I57)","v":""},{"$f":"IF(Inmeetformulier!J57=\"\",\"\",Inmeetformulier!J57)","v":""},{"$f":"IF(Inmeetformulier!K57=\"\",\"\",Inmeetformulier!K57)","v":""},{"$f":"IF(Inmeetformulier!L57=\"\",\"\",Inmeetformulier!L57)","v":""},{"$f":"IF(Inmeetformulier!M57=\"\",\"\",Inmeetformulier!M57)","v":""},{"$f":"IF(Inmeetformulier!N57=\"\",\"\",Inmeetformulier!N57)","v":""},{"$f":"IF(Inmeetformulier!O57=\"\",\"\",Inmeetformulier!O57)","v":""},{"$f":"IF(Inmeetformulier!B57=\"\",\"\",Inmeetformulier!B57)","v":""},{"$f":"IF(Inmeetformulier!S57=\"\",\"\",Inmeetformulier!S57)","v":""}]
[null,{"$f":"IF(Inmeetformulier!P58=\"\",\"\",Inmeetformulier!P58)","v":""},{"$f":"IF(Inmeetformulier!Q58=\"\",\"\",Inmeetformulier!Q58)","v":""},{"$f":"IF(Inmeetformulier!D58=\"\",\"\",Inmeetformulier!D58)","v":""},{"$f":"IF(Inmeetformulier!E58=\"\",\"\",Inmeetformulier!E58)","v":""},{"$f":"IF(Inmeetformulier!F58=\"\",\"\",Inmeetformulier!F58)","v":""},{"$f":"IF(Inmeetformulier!G58=\"\",\"\",Inmeetformulier!G58)","v":""},{"$f":"IF(Inmeetformulier!H58=\"\",\"\",Inmeetformulier!H58)","v":""},{"$f":"IF(Inmeetformulier!I58=\"\",\"\",Inmeetformulier!I58)","v":""},{"$f":"IF(Inmeetformulier!J58=\"\",\"\",Inmeetformulier!J58)","v":""},{"$f":"IF(Inmeetformulier!K58=\"\",\"\",Inmeetformulier!K58)","v":""},{"$f":"IF(Inmeetformulier!L58=\"\",\"\",Inmeetformulier!L58)","v":""},{"$f":"IF(Inmeetformulier!M58=\"\",\"\",Inmeetformulier!M58)","v":""},{"$f":"IF(Inmeetformulier!N58=\"\",\"\",Inmeetformulier!N58)","v":""},{"$f":"IF(Inmeetformulier!O58=\"\",\"\",Inmeetformulier!O58)","v":""},{"$f":"IF(Inmeetformulier!B58=\"\",\"\",Inmeetformulier!B58)","v":""},{"$f":"IF(Inmeetformulier!S58=\"\",\"\",Inmeetformulier!S58)","v":""}]
[null,{"$f":"IF(Inmeetformulier!P59=\"\",\"\",Inmeetformulier!P59)","v":""},{"$f":"IF(Inmeetformulier!Q59=\"\",\"\",Inmeetformulier!Q59)","v":""},{"$f":"IF(Inmeetformulier!D59=\"\",\"\",Inmeetformulier!D59)","v":""},{"$f":"IF(Inmeetformulier!E59=\"\",\"\",Inmeetformulier!E59)","v":""},{"$f":"IF(Inmeetformulier!F59=\"\",\"\",Inmeetformulier!F59)","v":""},{"$f":"IF(Inmeetformulier!G59=\"\",\"\",Inmeetformulier!G59)","v":""},{"$f":"IF(Inmeetformulier!H59=\"\",\"\",Inmeetformulier!H59)","v":""},{"$f":"IF(Inmeetformulier!I59=\"\",\"\",Inmeetformulier!I59)","v":""},{"$f":"IF(Inmeetformulier!J59=\"\",\"\",Inmeetformulier!J59)","v":""},{"$f":"IF(Inmeetformulier!K59=\"\",\"\",Inmeetformulier!K59)","v":""},{"$f":"IF(Inmeetformulier!L59=\"\",\"\",Inmeetformulier!L59)","v":""},{"$f":"IF(Inmeetformulier!M59=\"\",\"\",Inmeetformulier!M59)","v":""},{"$f":"IF(Inmeetformulier!N59=\"\",\"\",Inmeetformulier!N59)","v":""},{"$f":"IF(Inmeetformulier!O59=\"\",\"\",Inmeetformulier!O59)","v":""},{"$f":"IF(Inmeetformulier!B59=\"\",\"\",Inmeetformulier!B59)","v":""},{"$f":"IF(Inmeetformulier!S59=\"\",\"\",Inmeetformulier!S59)","v":""}]
[null,{"$f":"IF(Inmeetformulier!P60=\"\",\"\",Inmeetformulier!P60)","v":""},{"$f":"IF(Inmeetformulier!Q60=\"\",\"\",Inmeetformulier!Q60)","v":""},{"$f":"IF(Inmeetformulier!D60=\"\",\"\",Inmeetformulier!D60)","v":""},{"$f":"IF(Inmeetformulier!E60=\"\",\"\",Inmeetformulier!E60)","v":""},{"$f":"IF(Inmeetformulier!F60=\"\",\"\",Inmeetformulier!F60)","v":""},{"$f":"IF(Inmeetformulier!G60=\"\",\"\",Inmeetformulier!G60)","v":""},{"$f":"IF(Inmeetformulier!H60=\"\",\"\",Inmeetformulier!H60)","v":""},{"$f":"IF(Inmeetformulier!I60=\"\",\"\",Inmeetformulier!I60)","v":""},{"$f":"IF(Inmeetformulier!J60=\"\",\"\",Inmeetformulier!J60)","v":""},{"$f":"IF(Inmeetformulier!K60=\"\",\"\",Inmeetformulier!K60)","v":""},{"$f":"IF(Inmeetformulier!L60=\"\",\"\",Inmeetformulier!L60)","v":""},{"$f":"IF(Inmeetformulier!M60=\"\",\"\",Inmeetformulier!M60)","v":""},{"$f":"IF(Inmeetformulier!N60=\"\",\"\",Inmeetformulier!N60)","v":""},{"$f":"IF(Inmeetformulier!O60=\"\",\"\",Inmeetformulier!O60)","v":""},{"$f":"IF(Inmeetformulier!B60=\"\",\"\",Inmeetformulier!B60)","v":""},{"$f":"IF(Inmeetformulier!S60=\"\",\"\",Inmeetformulier!S60)","v":""}]
[null,{"$f":"IF(Inmeetformulier!P61=\"\",\"\",Inmeetformulier!P61)","v":""},{"$f":"IF(Inmeetformulier!Q61=\"\",\"\",Inmeetformulier!Q61)","v":""},{"$f":"IF(Inmeetformulier!D61=\"\",\"\",Inmeetformulier!D61)","v":""},{"$f":"IF(Inmeetformulier!E61=\"\",\"\",Inmeetformulier!E61)","v":""},{"$f":"IF(Inmeetformulier!F61=\"\",\"\",Inmeetformulier!F61)","v":""},{"$f":"IF(Inmeetformulier!G61=\"\",\"\",Inmeetformulier!G61)","v":""},{"$f":"IF(Inmeetformulier!H61=\"\",\"\",Inmeetformulier!H61)","v":""},{"$f":"IF(Inmeetformulier!I61=\"\",\"\",Inmeetformulier!I61)","v":""},{"$f":"IF(Inmeetformulier!J61=\"\",\"\",Inmeetformulier!J61)","v":""},{"$f":"IF(Inmeetformulier!K61=\"\",\"\",Inmeetformulier!K61)","v":""},{"$f":"IF(Inmeetformulier!L61=\"\",\"\",Inmeetformulier!L61)","v":""},{"$f":"IF(Inmeetformulier!M61=\"\",\"\",Inmeetformulier!M61)","v":""},{"$f":"IF(Inmeetformulier!N61=\"\",\"\",Inmeetformulier!N61)","v":""},{"$f":"IF(Inmeetformulier!O61=\"\",\"\",Inmeetformulier!O61)","v":""},{"$f":"IF(Inmeetformulier!B61=\"\",\"\",Inmeetformulier!B61)","v":""},{"$f":"IF(Inmeetformulier!S61=\"\",\"\",Inmeetformulier!S61)","v":""}]
[null,{"$f":"IF(Inmeetformulier!P62=\"\",\"\",Inmeetformulier!P62)","v":""},{"$f":"IF(Inmeetformulier!Q62=\"\",\"\",Inmeetformulier!Q62)","v":""},{"$f":"IF(Inmeetformulier!D62=\"\",\"\",Inmeetformulier!D62)","v":""},{"$f":"IF(Inmeetformulier!E62=\"\",\"\",Inmeetformulier!E62)","v":""},{"$f":"IF(Inmeetformulier!F62=\"\",\"\",Inmeetformulier!F62)","v":""},{"$f":"IF(Inmeetformulier!G62=\"\",\"\",Inmeetformulier!G62)","v":""},{"$f":"IF(Inmeetformulier!H62=\"\",\"\",Inmeetformulier!H62)","v":""},{"$f":"IF(Inmeetformulier!I62=\"\",\"\",Inmeetformulier!I62)","v":""},{"$f":"IF(Inmeetformulier!J62=\"\",\"\",Inmeetformulier!J62)","v":""},{"$f":"IF(Inmeetformulier!K62=\"\",\"\",Inmeetformulier!K62)","v":""},{"$f":"IF(Inmeetformulier!L62=\"\",\"\",Inmeetformulier!L62)","v":""},{"$f":"IF(Inmeetformulier!M62=\"\",\"\",Inmeetformulier!M62)","v":""},{"$f":"IF(Inmeetformulier!N62=\"\",\"\",Inmeetformulier!N62)","v":""},{"$f":"IF(Inmeetformulier!O62=\"\",\"\",Inmeetformulier!O62)","v":""},{"$f":"IF(Inmeetformulier!B62=\"\",\"\",Inmeetformulier!B62)","v":""},{"$f":"IF(Inmeetformulier!S62=\"\",\"\",Inmeetformulier!S62)","v":""}]
[null,{"$f":"IF(Inmeetformulier!P63=\"\",\"\",Inmeetformulier!P63)","v":""},{"$f":"IF(Inmeetformulier!Q63=\"\",\"\",Inmeetformulier!Q63)","v":""},{"$f":"IF(Inmeetformulier!D63=\"\",\"\",Inmeetformulier!D63)","v":""},{"$f":"IF(Inmeetformulier!E63=\"\",\"\",Inmeetformulier!E63)","v":""},{"$f":"IF(Inmeetformulier!F63=\"\",\"\",Inmeetformulier!F63)","v":""},{"$f":"IF(Inmeetformulier!G63=\"\",\"\",Inmeetformulier!G63)","v":""},{"$f":"IF(Inmeetformulier!H63=\"\",\"\",Inmeetformulier!H63)","v":""},{"$f":"IF(Inmeetformulier!I63=\"\",\"\",Inmeetformulier!I63)","v":""},{"$f":"IF(Inmeetformulier!J63=\"\",\"\",Inmeetformulier!J63)","v":""},{"$f":"IF(Inmeetformulier!K63=\"\",\"\",Inmeetformulier!K63)","v":""},{"$f":"IF(Inmeetformulier!L63=\"\",\"\",Inmeetformulier!L63)","v":""},{"$f":"IF(Inmeetformulier!M63=\"\",\"\",Inmeetformulier!M63)","v":""},{"$f":"IF(Inmeetformulier!N63=\"\",\"\",Inmeetformulier!N63)","v":""},{"$f":"IF(Inmeetformulier!O63=\"\",\"\",Inmeetformulier!O63)","v":""},{"$f":"IF(Inmeetformulier!B63=\"\",\"\",Inmeetformulier!B63)","v":""},{"$f":"IF(Inmeetformulier!S63=\"\",\"\",Inmeetformulier!S63)","v":""}]
[null,{"$f":"IF(Inmeetformulier!P64=\"\",\"\",Inmeetformulier!P64)","v":""},{"$f":"IF(Inmeetformulier!Q64=\"\",\"\",Inmeetformulier!Q64)","v":""},{"$f":"IF(Inmeetformulier!D64=\"\",\"\",Inmeetformulier!D64)","v":""},{"$f":"IF(Inmeetformulier!E64=\"\",\"\",Inmeetformulier!E64)","v":""},{"$f":"IF(Inmeetformulier!F64=\"\",\"\",Inmeetformulier!F64)","v":""},{"$f":"IF(Inmeetformulier!G64=\"\",\"\",Inmeetformulier!G64)","v":""},{"$f":"IF(Inmeetformulier!H64=\"\",\"\",Inmeetformulier!H64)","v":""},{"$f":"IF(Inmeetformulier!I64=\"\",\"\",Inmeetformulier!I64)","v":""},{"$f":"IF(Inmeetformulier!J64=\"\",\"\",Inmeetformulier!J64)","v":""},{"$f":"IF(Inmeetformulier!K64=\"\",\"\",Inmeetformulier!K64)","v":""},{"$f":"IF(Inmeetformulier!L64=\"\",\"\",Inmeetformulier!L64)","v":""},{"$f":"IF(Inmeetformulier!M64=\"\",\"\",Inmeetformulier!M64)","v":""},{"$f":"IF(Inmeetformulier!N64=\"\",\"\",Inmeetformulier!N64)","v":""},{"$f":"IF(Inmeetformulier!O64=\"\",\"\",Inmeetformulier!O64)","v":""},{"$f":"IF(Inmeetformulier!B64=\"\",\"\",Inmeetformulier!B64)","v":""},{"$f":"IF(Inmeetformulier!S64=\"\",\"\",Inmeetformulier!S64)","v":""}]
[null,{"$f":"IF(Inmeetformulier!P65=\"\",\"\",Inmeetformulier!P65)","v":""},{"$f":"IF(Inmeetformulier!Q65=\"\",\"\",Inmeetformulier!Q65)","v":""},{"$f":"IF(Inmeetformulier!D65=\"\",\"\",Inmeetformulier!D65)","v":""},{"$f":"IF(Inmeetformulier!E65=\"\",\"\",Inmeetformulier!E65)","v":""},{"$f":"IF(Inmeetformulier!F65=\"\",\"\",Inmeetformulier!F65)","v":""},{"$f":"IF(Inmeetformulier!G65=\"\",\"\",Inmeetformulier!G65)","v":""},{"$f":"IF(Inmeetformulier!H65=\"\",\"\",Inmeetformulier!H65)","v":""},{"$f":"IF(Inmeetformulier!I65=\"\",\"\",Inmeetformulier!I65)","v":""},{"$f":"IF(Inmeetformulier!J65=\"\",\"\",Inmeetformulier!J65)","v":""},{"$f":"IF(Inmeetformulier!K65=\"\",\"\",Inmeetformulier!K65)","v":""},{"$f":"IF(Inmeetformulier!L65=\"\",\"\",Inmeetformulier!L65)","v":""},{"$f":"IF(Inmeetformulier!M65=\"\",\"\",Inmeetformulier!M65)","v":""},{"$f":"IF(Inmeetformulier!N65=\"\",\"\",Inmeetformulier!N65)","v":""},{"$f":"IF(Inmeetformulier!O65=\"\",\"\",Inmeetformulier!O65)","v":""},{"$f":"IF(Inmeetformulier!B65=\"\",\"\",Inmeetformulier!B65)","v":""},{"$f":"IF(Inmeetformulier!S65=\"\",\"\",Inmeetformulier!S65)","v":""}]
[null,{"$f":"IF(Inmeetformulier!P66=\"\",\"\",Inmeetformulier!P66)","v":""},{"$f":"IF(Inmeetformulier!Q66=\"\",\"\",Inmeetformulier!Q66)","v":""},{"$f":"IF(Inmeetformulier!D66=\"\",\"\",Inmeetformulier!D66)","v":""},{"$f":"IF(Inmeetformulier!E66=\"\",\"\",Inmeetformulier!E66)","v":""},{"$f":"IF(Inmeetformulier!F66=\"\",\"\",Inmeetformulier!F66)","v":""},{"$f":"IF(Inmeetformulier!G66=\"\",\"\",Inmeetformulier!G66)","v":""},{"$f":"IF(Inmeetformulier!H66=\"\",\"\",Inmeetformulier!H66)","v":""},{"$f":"IF(Inmeetformulier!I66=\"\",\"\",Inmeetformulier!I66)","v":""},{"$f":"IF(Inmeetformulier!J66=\"\",\"\",Inmeetformulier!J66)","v":""},{"$f":"IF(Inmeetformulier!K66=\"\",\"\",Inmeetformulier!K66)","v":""},{"$f":"IF(Inmeetformulier!L66=\"\",\"\",Inmeetformulier!L66)","v":""},{"$f":"IF(Inmeetformulier!M66=\"\",\"\",Inmeetformulier!M66)","v":""},{"$f":"IF(Inmeetformulier!N66=\"\",\"\",Inmeetformulier!N66)","v":""},{"$f":"IF(Inmeetformulier!O66=\"\",\"\",Inmeetformulier!O66)","v":""},{"$f":"IF(Inmeetformulier!B66=\"\",\"\",Inmeetformulier!B66)","v":""},{"$f":"IF(Inmeetformulier!S66=\"\",\"\",Inmeetformulier!S66)","v":""}]
[null,{"$f":"IF(Inmeetformulier!P67=\"\",\"\",Inmeetformulier!P67)","v":""},{"$f":"IF(Inmeetformulier!Q67=\"\",\"\",Inmeetformulier!Q67)","v":""},{"$f":"IF(Inmeetformulier!D67=\"\",\"\",Inmeetformulier!D67)","v":""},{"$f":"IF(Inmeetformulier!E67=\"\",\"\",Inmeetformulier!E67)","v":""},{"$f":"IF(Inmeetformulier!F67=\"\",\"\",Inmeetformulier!F67)","v":""},{"$f":"IF(Inmeetformulier!G67=\"\",\"\",Inmeetformulier!G67)","v":""},{"$f":"IF(Inmeetformulier!H67=\"\",\"\",Inmeetformulier!H67)","v":""},{"$f":"IF(Inmeetformulier!I67=\"\",\"\",Inmeetformulier!I67)","v":""},{"$f":"IF(Inmeetformulier!J67=\"\",\"\",Inmeetformulier!J67)","v":""},{"$f":"IF(Inmeetformulier!K67=\"\",\"\",Inmeetformulier!K67)","v":""},{"$f":"IF(Inmeetformulier!L67=\"\",\"\",Inmeetformulier!L67)","v":""},{"$f":"IF(Inmeetformulier!M67=\"\",\"\",Inmeetformulier!M67)","v":""},{"$f":"IF(Inmeetformulier!N67=\"\",\"\",Inmeetformulier!N67)","v":""},{"$f":"IF(Inmeetformulier!O67=\"\",\"\",Inmeetformulier!O67)","v":""},{"$f":"IF(Inmeetformulier!B67=\"\",\"\",Inmeetformulier!B67)","v":""},{"$f":"IF(Inmeetformulier!S67=\"\",\"\",Inmeetformulier!S67)","v":""}]
[null,{"$f":"IF(Inmeetformulier!P68=\"\",\"\",Inmeetformulier!P68)","v":""},{"$f":"IF(Inmeetformulier!Q68=\"\",\"\",Inmeetformulier!Q68)","v":""},{"$f":"IF(Inmeetformulier!D68=\"\",\"\",Inmeetformulier!D68)","v":""},{"$f":"IF(Inmeetformulier!E68=\"\",\"\",Inmeetformulier!E68)","v":""},{"$f":"IF(Inmeetformulier!F68=\"\",\"\",Inmeetformulier!F68)","v":""},{"$f":"IF(Inmeetformulier!G68=\"\",\"\",Inmeetformulier!G68)","v":""},{"$f":"IF(Inmeetformulier!H68=\"\",\"\",Inmeetformulier!H68)","v":""},{"$f":"IF(Inmeetformulier!I68=\"\",\"\",Inmeetformulier!I68)","v":""},{"$f":"IF(Inmeetformulier!J68=\"\",\"\",Inmeetformulier!J68)","v":""},{"$f":"IF(Inmeetformulier!K68=\"\",\"\",Inmeetformulier!K68)","v":""},{"$f":"IF(Inmeetformulier!L68=\"\",\"\",Inmeetformulier!L68)","v":""},{"$f":"IF(Inmeetformulier!M68=\"\",\"\",Inmeetformulier!M68)","v":""},{"$f":"IF(Inmeetformulier!N68=\"\",\"\",Inmeetformulier!N68)","v":""},{"$f":"IF(Inmeetformulier!O68=\"\",\"\",Inmeetformulier!O68)","v":""},{"$f":"IF(Inmeetformulier!B68=\"\",\"\",Inmeetformulier!B68)","v":""},{"$f":"IF(Inmeetformulier!S68=\"\",\"\",Inmeetformulier!S68)","v":""}]
[null,{"$f":"IF(Inmeetformulier!P69=\"\",\"\",Inmeetformulier!P69)","v":""},{"$f":"IF(Inmeetformulier!Q69=\"\",\"\",Inmeetformulier!Q69)","v":""},{"$f":"IF(Inmeetformulier!D69=\"\",\"\",Inmeetformulier!D69)","v":""},{"$f":"IF(Inmeetformulier!E69=\"\",\"\",Inmeetformulier!E69)","v":""},{"$f":"IF(Inmeetformulier!F69=\"\",\"\",Inmeetformulier!F69)","v":""},{"$f":"IF(Inmeetformulier!G69=\"\",\"\",Inmeetformulier!G69)","v":""},{"$f":"IF(Inmeetformulier!H69=\"\",\"\",Inmeetformulier!H69)","v":""},{"$f":"IF(Inmeetformulier!I69=\"\",\"\",Inmeetformulier!I69)","v":""},{"$f":"IF(Inmeetformulier!J69=\"\",\"\",Inmeetformulier!J69)","v":""},{"$f":"IF(Inmeetformulier!K69=\"\",\"\",Inmeetformulier!K69)","v":""},{"$f":"IF(Inmeetformulier!L69=\"\",\"\",Inmeetformulier!L69)","v":""},{"$f":"IF(Inmeetformulier!M69=\"\",\"\",Inmeetformulier!M69)","v":""},{"$f":"IF(Inmeetformulier!N69=\"\",\"\",Inmeetformulier!N69)","v":""},{"$f":"IF(Inmeetformulier!O69=\"\",\"\",Inmeetformulier!O69)","v":""},{"$f":"IF(Inmeetformulier!B69=\"\",\"\",Inmeetformulier!B69)","v":""},{"$f":"IF(Inmeetformulier!S69=\"\",\"\",Inmeetformulier!S69)","v":""}]
[null,{"$f":"IF(Inmeetformulier!P70=\"\",\"\",Inmeetformulier!P70)","v":""},{"$f":"IF(Inmeetformulier!Q70=\"\",\"\",Inmeetformulier!Q70)","v":""},{"$f":"IF(Inmeetformulier!D70=\"\",\"\",Inmeetformulier!D70)","v":""},{"$f":"IF(Inmeetformulier!E70=\"\",\"\",Inmeetformulier!E70)","v":""},{"$f":"IF(Inmeetformulier!F70=\"\",\"\",Inmeetformulier!F70)","v":""},{"$f":"IF(Inmeetformulier!G70=\"\",\"\",Inmeetformulier!G70)","v":""},{"$f":"IF(Inmeetformulier!H70=\"\",\"\",Inmeetformulier!H70)","v":""},{"$f":"IF(Inmeetformulier!I70=\"\",\"\",Inmeetformulier!I70)","v":""},{"$f":"IF(Inmeetformulier!J70=\"\",\"\",Inmeetformulier!J70)","v":""},{"$f":"IF(Inmeetformulier!K70=\"\",\"\",Inmeetformulier!K70)","v":""},{"$f":"IF(Inmeetformulier!L70=\"\",\"\",Inmeetformulier!L70)","v":""},{"$f":"IF(Inmeetformulier!M70=\"\",\"\",Inmeetformulier!M70)","v":""},{"$f":"IF(Inmeetformulier!N70=\"\",\"\",Inmeetformulier!N70)","v":""},{"$f":"IF(Inmeetformulier!O70=\"\",\"\",Inmeetformulier!O70)","v":""},{"$f":"IF(Inmeetformulier!B70=\"\",\"\",Inmeetformulier!B70)","v":""},{"$f":"IF(Inmeetformulier!S70=\"\",\"\",Inmeetformulier!S70)","v":""}]
[null,{"$f":"IF(Inmeetformulier!P71=\"\",\"\",Inmeetformulier!P71)","v":""},{"$f":"IF(Inmeetformulier!Q71=\"\",\"\",Inmeetformulier!Q71)","v":""},{"$f":"IF(Inmeetformulier!D71=\"\",\"\",Inmeetformulier!D71)","v":""},{"$f":"IF(Inmeetformulier!E71=\"\",\"\",Inmeetformulier!E71)","v":""},{"$f":"IF(Inmeetformulier!F71=\"\",\"\",Inmeetformulier!F71)","v":""},{"$f":"IF(Inmeetformulier!G71=\"\",\"\",Inmeetformulier!G71)","v":""},{"$f":"IF(Inmeetformulier!H71=\"\",\"\",Inmeetformulier!H71)","v":""},{"$f":"IF(Inmeetformulier!I71=\"\",\"\",Inmeetformulier!I71)","v":""},{"$f":"IF(Inmeetformulier!J71=\"\",\"\",Inmeetformulier!J71)","v":""},{"$f":"IF(Inmeetformulier!K71=\"\",\"\",Inmeetformulier!K71)","v":""},{"$f":"IF(Inmeetformulier!L71=\"\",\"\",Inmeetformulier!L71)","v":""},{"$f":"IF(Inmeetformulier!M71=\"\",\"\",Inmeetformulier!M71)","v":""},{"$f":"IF(Inmeetformulier!N71=\"\",\"\",Inmeetformulier!N71)","v":""},{"$f":"IF(Inmeetformulier!O71=\"\",\"\",Inmeetformulier!O71)","v":""},{"$f":"IF(Inmeetformulier!B71=\"\",\"\",Inmeetformulier!B71)","v":""},{"$f":"IF(Inmeetformulier!S71=\"\",\"\",Inmeetformulier!S71)","v":""}]
[null,{"$f":"IF(Inmeetformulier!P72=\"\",\"\",Inmeetformulier!P72)","v":""},{"$f":"IF(Inmeetformulier!Q72=\"\",\"\",Inmeetformulier!Q72)","v":""},{"$f":"IF(Inmeetformulier!D72=\"\",\"\",Inmeetformulier!D72)","v":""},{"$f":"IF(Inmeetformulier!E72=\"\",\"\",Inmeetformulier!E72)","v":""},{"$f":"IF(Inmeetformulier!F72=\"\",\"\",Inmeetformulier!F72)","v":""},{"$f":"IF(Inmeetformulier!G72=\"\",\"\",Inmeetformulier!G72)","v":""},{"$f":"IF(Inmeetformulier!H72=\"\",\"\",Inmeetformulier!H72)","v":""},{"$f":"IF(Inmeetformulier!I72=\"\",\"\",Inmeetformulier!I72)","v":""},{"$f":"IF(Inmeetformulier!J72=\"\",\"\",Inmeetformulier!J72)","v":""},{"$f":"IF(Inmeetformulier!K72=\"\",\"\",Inmeetformulier!K72)","v":""},{"$f":"IF(Inmeetformulier!L72=\"\",\"\",Inmeetformulier!L72)","v":""},{"$f":"IF(Inmeetformulier!M72=\"\",\"\",Inmeetformulier!M72)","v":""},{"$f":"IF(Inmeetformulier!N72=\"\",\"\",Inmeetformulier!N72)","v":""},{"$f":"IF(Inmeetformulier!O72=\"\",\"\",Inmeetformulier!O72)","v":""},{"$f":"IF(Inmeetformulier!B72=\"\",\"\",Inmeetformulier!B72)","v":""},{"$f":"IF(Inmeetformulier!S72=\"\",\"\",Inmeetformulier!S72)","v":""}]
[null,{"$f":"IF(Inmeetformulier!P73=\"\",\"\",Inmeetformulier!P73)","v":""},{"$f":"IF(Inmeetformulier!Q73=\"\",\"\",Inmeetformulier!Q73)","v":""},{"$f":"IF(Inmeetformulier!D73=\"\",\"\",Inmeetformulier!D73)","v":""},{"$f":"IF(Inmeetformulier!E73=\"\",\"\",Inmeetformulier!E73)","v":""},{"$f":"IF(Inmeetformulier!F73=\"\",\"\",Inmeetformulier!F73)","v":""},{"$f":"IF(Inmeetformulier!G73=\"\",\"\",Inmeetformulier!G73)","v":""},{"$f":"IF(Inmeetformulier!H73=\"\",\"\",Inmeetformulier!H73)","v":""},{"$f":"IF(Inmeetformulier!I73=\"\",\"\",Inmeetformulier!I73)","v":""},{"$f":"IF(Inmeetformulier!J73=\"\",\"\",Inmeetformulier!J73)","v":""},{"$f":"IF(Inmeetformulier!K73=\"\",\"\",Inmeetformulier!K73)","v":""},{"$f":"IF(Inmeetformulier!L73=\"\",\"\",Inmeetformulier!L73)","v":""},{"$f":"IF(Inmeetformulier!M73=\"\",\"\",Inmeetformulier!M73)","v":""},{"$f":"IF(Inmeetformulier!N73=\"\",\"\",Inmeetformulier!N73)","v":""},{"$f":"IF(Inmeetformulier!O73=\"\",\"\",Inmeetformulier!O73)","v":""},{"$f":"IF(Inmeetformulier!B73=\"\",\"\",Inmeetformulier!B73)","v":""},{"$f":"IF(Inmeetformulier!S73=\"\",\"\",Inmeetformulier!S73)","v":""}]
[null,{"$f":"IF(Inmeetformulier!P74=\"\",\"\",Inmeetformulier!P74)","v":""},{"$f":"IF(Inmeetformulier!Q74=\"\",\"\",Inmeetformulier!Q74)","v":""},{"$f":"IF(Inmeetformulier!D74=\"\",\"\",Inmeetformulier!D74)","v":""},{"$f":"IF(Inmeetformulier!E74=\"\",\"\",Inmeetformulier!E74)","v":""},{"$f":"IF(Inmeetformulier!F74=\"\",\"\",Inmeetformulier!F74)","v":""},{"$f":"IF(Inmeetformulier!G74=\"\",\"\",Inmeetformulier!G74)","v":""},{"$f":"IF(Inmeetformulier!H74=\"\",\"\",Inmeetformulier!H74)","v":""},{"$f":"IF(Inmeetformulier!I74=\"\",\"\",Inmeetformulier!I74)","v":""},{"$f":"IF(Inmeetformulier!J74=\"\",\"\",Inmeetformulier!J74)","v":""},{"$f":"IF(Inmeetformulier!K74=\"\",\"\",Inmeetformulier!K74)","v":""},{"$f":"IF(Inmeetformulier!L74=\"\",\"\",Inmeetformulier!L74)","v":""},{"$f":"IF(Inmeetformulier!M74=\"\",\"\",Inmeetformulier!M74)","v":""},{"$f":"IF(Inmeetformulier!N74=\"\",\"\",Inmeetformulier!N74)","v":""},{"$f":"IF(Inmeetformulier!O74=\"\",\"\",Inmeetformulier!O74)","v":""},{"$f":"IF(Inmeetformulier!B74=\"\",\"\",Inmeetformulier!B74)","v":""},{"$f":"IF(Inmeetformulier!S74=\"\",\"\",Inmeetformulier!S74)","v":""}]
[null,{"$f":"IF(Inmeetformulier!P75=\"\",\"\",Inmeetformulier!P75)","v":""},{"$f":"IF(Inmeetformulier!Q75=\"\",\"\",Inmeetformulier!Q75)","v":""},{"$f":"IF(Inmeetformulier!D75=\"\",\"\",Inmeetformulier!D75)","v":""},{"$f":"IF(Inmeetformulier!E75=\"\",\"\",Inmeetformulier!E75)","v":""},{"$f":"IF(Inmeetformulier!F75=\"\",\"\",Inmeetformulier!F75)","v":""},{"$f":"IF(Inmeetformulier!G75=\"\",\"\",Inmeetformulier!G75)","v":""},{"$f":"IF(Inmeetformulier!H75=\"\",\"\",Inmeetformulier!H75)","v":""},{"$f":"IF(Inmeetformulier!I75=\"\",\"\",Inmeetformulier!I75)","v":""},{"$f":"IF(Inmeetformulier!J75=\"\",\"\",Inmeetformulier!J75)","v":""},{"$f":"IF(Inmeetformulier!K75=\"\",\"\",Inmeetformulier!K75)","v":""},{"$f":"IF(Inmeetformulier!L75=\"\",\"\",Inmeetformulier!L75)","v":""},{"$f":"IF(Inmeetformulier!M75=\"\",\"\",Inmeetformulier!M75)","v":""},{"$f":"IF(Inmeetformulier!N75=\"\",\"\",Inmeetformulier!N75)","v":""},{"$f":"IF(Inmeetformulier!O75=\"\",\"\",Inmeetformulier!O75)","v":""},{"$f":"IF(Inmeetformulier!B75=\"\",\"\",Inmeetformulier!B75)","v":""},{"$f":"IF(Inmeetformulier!S75=\"\",\"\",Inmeetformulier!S75)","v":""}]
[null,{"$f":"IF(Inmeetformulier!P76=\"\",\"\",Inmeetformulier!P76)","v":""},{"$f":"IF(Inmeetformulier!Q76=\"\",\"\",Inmeetformulier!Q76)","v":""},{"$f":"IF(Inmeetformulier!D76=\"\",\"\",Inmeetformulier!D76)","v":""},{"$f":"IF(Inmeetformulier!E76=\"\",\"\",Inmeetformulier!E76)","v":""},{"$f":"IF(Inmeetformulier!F76=\"\",\"\",Inmeetformulier!F76)","v":""},{"$f":"IF(Inmeetformulier!G76=\"\",\"\",Inmeetformulier!G76)","v":""},{"$f":"IF(Inmeetformulier!H76=\"\",\"\",Inmeetformulier!H76)","v":""},{"$f":"IF(Inmeetformulier!I76=\"\",\"\",Inmeetformulier!I76)","v":""},{"$f":"IF(Inmeetformulier!J76=\"\",\"\",Inmeetformulier!J76)","v":""},{"$f":"IF(Inmeetformulier!K76=\"\",\"\",Inmeetformulier!K76)","v":""},{"$f":"IF(Inmeetformulier!L76=\"\",\"\",Inmeetformulier!L76)","v":""},{"$f":"IF(Inmeetformulier!M76=\"\",\"\",Inmeetformulier!M76)","v":""},{"$f":"IF(Inmeetformulier!N76=\"\",\"\",Inmeetformulier!N76)","v":""},{"$f":"IF(Inmeetformulier!O76=\"\",\"\",Inmeetformulier!O76)","v":""},{"$f":"IF(Inmeetformulier!B76=\"\",\"\",Inmeetformulier!B76)","v":""},{"$f":"IF(Inmeetformulier!S76=\"\",\"\",Inmeetformulier!S76)","v":""}]
[null,{"$f":"IF(Inmeetformulier!P77=\"\",\"\",Inmeetformulier!P77)","v":""},{"$f":"IF(Inmeetformulier!Q77=\"\",\"\",Inmeetformulier!Q77)","v":""},{"$f":"IF(Inmeetformulier!D77=\"\",\"\",Inmeetformulier!D77)","v":""},{"$f":"IF(Inmeetformulier!E77=\"\",\"\",Inmeetformulier!E77)","v":""},{"$f":"IF(Inmeetformulier!F77=\"\",\"\",Inmeetformulier!F77)","v":""},{"$f":"IF(Inmeetformulier!G77=\"\",\"\",Inmeetformulier!G77)","v":""},{"$f":"IF(Inmeetformulier!H77=\"\",\"\",Inmeetformulier!H77)","v":""},{"$f":"IF(Inmeetformulier!I77=\"\",\"\",Inmeetformulier!I77)","v":""},{"$f":"IF(Inmeetformulier!J77=\"\",\"\",Inmeetformulier!J77)","v":""},{"$f":"IF(Inmeetformulier!K77=\"\",\"\",Inmeetformulier!K77)","v":""},{"$f":"IF(Inmeetformulier!L77=\"\",\"\",Inmeetformulier!L77)","v":""},{"$f":"IF(Inmeetformulier!M77=\"\",\"\",Inmeetformulier!M77)","v":""},{"$f":"IF(Inmeetformulier!N77=\"\",\"\",Inmeetformulier!N77)","v":""},{"$f":"IF(Inmeetformulier!O77=\"\",\"\",Inmeetformulier!O77)","v":""},{"$f":"IF(Inmeetformulier!B77=\"\",\"\",Inmeetformulier!B77)","v":""},{"$f":"IF(Inmeetformulier!S77=\"\",\"\",Inmeetformulier!S77)","v":""}]
[null,{"$f":"IF(Inmeetformulier!P78=\"\",\"\",Inmeetformulier!P78)","v":""},{"$f":"IF(Inmeetformulier!Q78=\"\",\"\",Inmeetformulier!Q78)","v":""},{"$f":"IF(Inmeetformulier!D78=\"\",\"\",Inmeetformulier!D78)","v":""},{"$f":"IF(Inmeetformulier!E78=\"\",\"\",Inmeetformulier!E78)","v":""},{"$f":"IF(Inmeetformulier!F78=\"\",\"\",Inmeetformulier!F78)","v":""},{"$f":"IF(Inmeetformulier!G78=\"\",\"\",Inmeetformulier!G78)","v":""},{"$f":"IF(Inmeetformulier!H78=\"\",\"\",Inmeetformulier!H78)","v":""},{"$f":"IF(Inmeetformulier!I78=\"\",\"\",Inmeetformulier!I78)","v":""},{"$f":"IF(Inmeetformulier!J78=\"\",\"\",Inmeetformulier!J78)","v":""},{"$f":"IF(Inmeetformulier!K78=\"\",\"\",Inmeetformulier!K78)","v":""},{"$f":"IF(Inmeetformulier!L78=\"\",\"\",Inmeetformulier!L78)","v":""},{"$f":"IF(Inmeetformulier!M78=\"\",\"\",Inmeetformulier!M78)","v":""},{"$f":"IF(Inmeetformulier!N78=\"\",\"\",Inmeetformulier!N78)","v":""},{"$f":"IF(Inmeetformulier!O78=\"\",\"\",Inmeetformulier!O78)","v":""},{"$f":"IF(Inmeetformulier!B78=\"\",\"\",Inmeetformulier!B78)","v":""},{"$f":"IF(Inmeetformulier!S78=\"\",\"\",Inmeetformulier!S78)","v":""}]
[null,{"$f":"IF(Inmeetformulier!P79=\"\",\"\",Inmeetformulier!P79)","v":""},{"$f":"IF(Inmeetformulier!Q79=\"\",\"\",Inmeetformulier!Q79)","v":""},{"$f":"IF(Inmeetformulier!D79=\"\",\"\",Inmeetformulier!D79)","v":""},{"$f":"IF(Inmeetformulier!E79=\"\",\"\",Inmeetformulier!E79)","v":""},{"$f":"IF(Inmeetformulier!F79=\"\",\"\",Inmeetformulier!F79)","v":""},{"$f":"IF(Inmeetformulier!G79=\"\",\"\",Inmeetformulier!G79)","v":""},{"$f":"IF(Inmeetformulier!H79=\"\",\"\",Inmeetformulier!H79)","v":""},{"$f":"IF(Inmeetformulier!I79=\"\",\"\",Inmeetformulier!I79)","v":""},{"$f":"IF(Inmeetformulier!J79=\"\",\"\",Inmeetformulier!J79)","v":""},{"$f":"IF(Inmeetformulier!K79=\"\",\"\",Inmeetformulier!K79)","v":""},{"$f":"IF(Inmeetformulier!L79=\"\",\"\",Inmeetformulier!L79)","v":""},{"$f":"IF(Inmeetformulier!M79=\"\",\"\",Inmeetformulier!M79)","v":""},{"$f":"IF(Inmeetformulier!N79=\"\",\"\",Inmeetformulier!N79)","v":""},{"$f":"IF(Inmeetformulier!O79=\"\",\"\",Inmeetformulier!O79)","v":""},{"$f":"IF(Inmeetformulier!B79=\"\",\"\",Inmeetformulier!B79)","v":""},{"$f":"IF(Inmeetformulier!S79=\"\",\"\",Inmeetformulier!S79)","v":""}]
[null,{"$f":"IF(Inmeetformulier!P80=\"\",\"\",Inmeetformulier!P80)","v":""},{"$f":"IF(Inmeetformulier!Q80=\"\",\"\",Inmeetformulier!Q80)","v":""},{"$f":"IF(Inmeetformulier!D80=\"\",\"\",Inmeetformulier!D80)","v":""},{"$f":"IF(Inmeetformulier!E80=\"\",\"\",Inmeetformulier!E80)","v":""},{"$f":"IF(Inmeetformulier!F80=\"\",\"\",Inmeetformulier!F80)","v":""},{"$f":"IF(Inmeetformulier!G80=\"\",\"\",Inmeetformulier!G80)","v":""},{"$f":"IF(Inmeetformulier!H80=\"\",\"\",Inmeetformulier!H80)","v":""},{"$f":"IF(Inmeetformulier!I80=\"\",\"\",Inmeetformulier!I80)","v":""},{"$f":"IF(Inmeetformulier!J80=\"\",\"\",Inmeetformulier!J80)","v":""},{"$f":"IF(Inmeetformulier!K80=\"\",\"\",Inmeetformulier!K80)","v":""},{"$f":"IF(Inmeetformulier!L80=\"\",\"\",Inmeetformulier!L80)","v":""},{"$f":"IF(Inmeetformulier!M80=\"\",\"\",Inmeetformulier!M80)","v":""},{"$f":"IF(Inmeetformulier!N80=\"\",\"\",Inmeetformulier!N80)","v":""},{"$f":"IF(Inmeetformulier!O80=\"\",\"\",Inmeetformulier!O80)","v":""},{"$f":"IF(Inmeetformulier!B80=\"\",\"\",Inmeetformulier!B80)","v":""},{"$f":"IF(Inmeetformulier!S80=\"\",\"\",Inmeetformulier!S80)","v":""}]
[null,{"$f":"IF(Inmeetformulier!P81=\"\",\"\",Inmeetformulier!P81)","v":""},{"$f":"IF(Inmeetformulier!Q81=\"\",\"\",Inmeetformulier!Q81)","v":""},{"$f":"IF(Inmeetformulier!D81=\"\",\"\",Inmeetformulier!D81)","v":""},{"$f":"IF(Inmeetformulier!E81=\"\",\"\",Inmeetformulier!E81)","v":""},{"$f":"IF(Inmeetformulier!F81=\"\",\"\",Inmeetformulier!F81)","v":""},{"$f":"IF(Inmeetformulier!G81=\"\",\"\",Inmeetformulier!G81)","v":""},{"$f":"IF(Inmeetformulier!H81=\"\",\"\",Inmeetformulier!H81)","v":""},{"$f":"IF(Inmeetformulier!I81=\"\",\"\",Inmeetformulier!I81)","v":""},{"$f":"IF(Inmeetformulier!J81=\"\",\"\",Inmeetformulier!J81)","v":""},{"$f":"IF(Inmeetformulier!K81=\"\",\"\",Inmeetformulier!K81)","v":""},{"$f":"IF(Inmeetformulier!L81=\"\",\"\",Inmeetformulier!L81)","v":""},{"$f":"IF(Inmeetformulier!M81=\"\",\"\",Inmeetformulier!M81)","v":""},{"$f":"IF(Inmeetformulier!N81=\"\",\"\",Inmeetformulier!N81)","v":""},{"$f":"IF(Inmeetformulier!O81=\"\",\"\",Inmeetformulier!O81)","v":""},{"$f":"IF(Inmeetformulier!B81=\"\",\"\",Inmeetformulier!B81)","v":""},{"$f":"IF(Inmeetformulier!S81=\"\",\"\",Inmeetformulier!S81)","v":""}]
[null,{"$f":"IF(Inmeetformulier!P82=\"\",\"\",Inmeetformulier!P82)","v":""},{"$f":"IF(Inmeetformulier!Q82=\"\",\"\",Inmeetformulier!Q82)","v":""},{"$f":"IF(Inmeetformulier!D82=\"\",\"\",Inmeetformulier!D82)","v":""},{"$f":"IF(Inmeetformulier!E82=\"\",\"\",Inmeetformulier!E82)","v":""},{"$f":"IF(Inmeetformulier!F82=\"\",\"\",Inmeetformulier!F82)","v":""},{"$f":"IF(Inmeetformulier!G82=\"\",\"\",Inmeetformulier!G82)","v":""},{"$f":"IF(Inmeetformulier!H82=\"\",\"\",Inmeetformulier!H82)","v":""},{"$f":"IF(Inmeetformulier!I82=\"\",\"\",Inmeetformulier!I82)","v":""},{"$f":"IF(Inmeetformulier!J82=\"\",\"\",Inmeetformulier!J82)","v":""},{"$f":"IF(Inmeetformulier!K82=\"\",\"\",Inmeetformulier!K82)","v":""},{"$f":"IF(Inmeetformulier!L82=\"\",\"\",Inmeetformulier!L82)","v":""},{"$f":"IF(Inmeetformulier!M82=\"\",\"\",Inmeetformulier!M82)","v":""},{"$f":"IF(Inmeetformulier!N82=\"\",\"\",Inmeetformulier!N82)","v":""},{"$f":"IF(Inmeetformulier!O82=\"\",\"\",Inmeetformulier!O82)","v":""},{"$f":"IF(Inmeetformulier!B82=\"\",\"\",Inmeetformulier!B82)","v":""},{"$f":"IF(Inmeetformulier!S82=\"\",\"\",Inmeetformulier!S82)","v":""}]
[null,{"$f":"IF(Inmeetformulier!P83=\"\",\"\",Inmeetformulier!P83)","v":""},{"$f":"IF(Inmeetformulier!Q83=\"\",\"\",Inmeetformulier!Q83)","v":""},{"$f":"IF(Inmeetformulier!D83=\"\",\"\",Inmeetformulier!D83)","v":""},{"$f":"IF(Inmeetformulier!E83=\"\",\"\",Inmeetformulier!E83)","v":""},{"$f":"IF(Inmeetformulier!F83=\"\",\"\",Inmeetformulier!F83)","v":""},{"$f":"IF(Inmeetformulier!G83=\"\",\"\",Inmeetformulier!G83)","v":""},{"$f":"IF(Inmeetformulier!H83=\"\",\"\",Inmeetformulier!H83)","v":""},{"$f":"IF(Inmeetformulier!I83=\"\",\"\",Inmeetformulier!I83)","v":""},{"$f":"IF(Inmeetformulier!J83=\"\",\"\",Inmeetformulier!J83)","v":""},{"$f":"IF(Inmeetformulier!K83=\"\",\"\",Inmeetformulier!K83)","v":""},{"$f":"IF(Inmeetformulier!L83=\"\",\"\",Inmeetformulier!L83)","v":""},{"$f":"IF(Inmeetformulier!M83=\"\",\"\",Inmeetformulier!M83)","v":""},{"$f":"IF(Inmeetformulier!N83=\"\",\"\",Inmeetformulier!N83)","v":""},{"$f":"IF(Inmeetformulier!O83=\"\",\"\",Inmeetformulier!O83)","v":""},{"$f":"IF(Inmeetformulier!B83=\"\",\"\",Inmeetformulier!B83)","v":""},{"$f":"IF(Inmeetformulier!S83=\"\",\"\",Inmeetformulier!S83)","v":""}]
[null,{"$f":"IF(Inmeetformulier!P84=\"\",\"\",Inmeetformulier!P84)","v":""},{"$f":"IF(Inmeetformulier!Q84=\"\",\"\",Inmeetformulier!Q84)","v":""},{"$f":"IF(Inmeetformulier!D84=\"\",\"\",Inmeetformulier!D84)","v":""},{"$f":"IF(Inmeetformulier!E84=\"\",\"\",Inmeetformulier!E84)","v":""},{"$f":"IF(Inmeetformulier!F84=\"\",\"\",Inmeetformulier!F84)","v":""},{"$f":"IF(Inmeetformulier!G84=\"\",\"\",Inmeetformulier!G84)","v":""},{"$f":"IF(Inmeetformulier!H84=\"\",\"\",Inmeetformulier!H84)","v":""},{"$f":"IF(Inmeetformulier!I84=\"\",\"\",Inmeetformulier!I84)","v":""},{"$f":"IF(Inmeetformulier!J84=\"\",\"\",Inmeetformulier!J84)","v":""},{"$f":"IF(Inmeetformulier!K84=\"\",\"\",Inmeetformulier!K84)","v":""},{"$f":"IF(Inmeetformulier!L84=\"\",\"\",Inmeetformulier!L84)","v":""},{"$f":"IF(Inmeetformulier!M84=\"\",\"\",Inmeetformulier!M84)","v":""},{"$f":"IF(Inmeetformulier!N84=\"\",\"\",Inmeetformulier!N84)","v":""},{"$f":"IF(Inmeetformulier!O84=\"\",\"\",Inmeetformulier!O84)","v":""},{"$f":"IF(Inmeetformulier!B84=\"\",\"\",Inmeetformulier!B84)","v":""},{"$f":"IF(Inmeetformulier!S84=\"\",\"\",Inmeetformulier!S84)","v":""}]
[null,{"$f":"IF(Inmeetformulier!P85=\"\",\"\",Inmeetformulier!P85)","v":""},{"$f":"IF(Inmeetformulier!Q85=\"\",\"\",Inmeetformulier!Q85)","v":""},{"$f":"IF(Inmeetformulier!D85=\"\",\"\",Inmeetformulier!D85)","v":""},{"$f":"IF(Inmeetformulier!E85=\"\",\"\",Inmeetformulier!E85)","v":""},{"$f":"IF(Inmeetformulier!F85=\"\",\"\",Inmeetformulier!F85)","v":""},{"$f":"IF(Inmeetformulier!G85=\"\",\"\",Inmeetformulier!G85)","v":""},{"$f":"IF(Inmeetformulier!H85=\"\",\"\",Inmeetformulier!H85)","v":""},{"$f":"IF(Inmeetformulier!I85=\"\",\"\",Inmeetformulier!I85)","v":""},{"$f":"IF(Inmeetformulier!J85=\"\",\"\",Inmeetformulier!J85)","v":""},{"$f":"IF(Inmeetformulier!K85=\"\",\"\",Inmeetformulier!K85)","v":""},{"$f":"IF(Inmeetformulier!L85=\"\",\"\",Inmeetformulier!L85)","v":""},{"$f":"IF(Inmeetformulier!M85=\"\",\"\",Inmeetformulier!M85)","v":""},{"$f":"IF(Inmeetformulier!N85=\"\",\"\",Inmeetformulier!N85)","v":""},{"$f":"IF(Inmeetformulier!O85=\"\",\"\",Inmeetformulier!O85)","v":""},{"$f":"IF(Inmeetformulier!B85=\"\",\"\",Inmeetformulier!B85)","v":""},{"$f":"IF(Inmeetformulier!S85=\"\",\"\",Inmeetformulier!S85)","v":""}]
[null,{"$f":"IF(Inmeetformulier!P86=\"\",\"\",Inmeetformulier!P86)","v":""},{"$f":"IF(Inmeetformulier!Q86=\"\",\"\",Inmeetformulier!Q86)","v":""},{"$f":"IF(Inmeetformulier!D86=\"\",\"\",Inmeetformulier!D86)","v":""},{"$f":"IF(Inmeetformulier!E86=\"\",\"\",Inmeetformulier!E86)","v":""},{"$f":"IF(Inmeetformulier!F86=\"\",\"\",Inmeetformulier!F86)","v":""},{"$f":"IF(Inmeetformulier!G86=\"\",\"\",Inmeetformulier!G86)","v":""},{"$f":"IF(Inmeetformulier!H86=\"\",\"\",Inmeetformulier!H86)","v":""},{"$f":"IF(Inmeetformulier!I86=\"\",\"\",Inmeetformulier!I86)","v":""},{"$f":"IF(Inmeetformulier!J86=\"\",\"\",Inmeetformulier!J86)","v":""},{"$f":"IF(Inmeetformulier!K86=\"\",\"\",Inmeetformulier!K86)","v":""},{"$f":"IF(Inmeetformulier!L86=\"\",\"\",Inmeetformulier!L86)","v":""},{"$f":"IF(Inmeetformulier!M86=\"\",\"\",Inmeetformulier!M86)","v":""},{"$f":"IF(Inmeetformulier!N86=\"\",\"\",Inmeetformulier!N86)","v":""},{"$f":"IF(Inmeetformulier!O86=\"\",\"\",Inmeetformulier!O86)","v":""},{"$f":"IF(Inmeetformulier!B86=\"\",\"\",Inmeetformulier!B86)","v":""},{"$f":"IF(Inmeetformulier!S86=\"\",\"\",Inmeetformulier!S86)","v":""}]
[null,{"$f":"IF(Inmeetformulier!P87=\"\",\"\",Inmeetformulier!P87)","v":""},{"$f":"IF(Inmeetformulier!Q87=\"\",\"\",Inmeetformulier!Q87)","v":""},{"$f":"IF(Inmeetformulier!D87=\"\",\"\",Inmeetformulier!D87)","v":""},{"$f":"IF(Inmeetformulier!E87=\"\",\"\",Inmeetformulier!E87)","v":""},{"$f":"IF(Inmeetformulier!F87=\"\",\"\",Inmeetformulier!F87)","v":""},{"$f":"IF(Inmeetformulier!G87=\"\",\"\",Inmeetformulier!G87)","v":""},{"$f":"IF(Inmeetformulier!H87=\"\",\"\",Inmeetformulier!H87)","v":""},{"$f":"IF(Inmeetformulier!I87=\"\",\"\",Inmeetformulier!I87)","v":""},{"$f":"IF(Inmeetformulier!J87=\"\",\"\",Inmeetformulier!J87)","v":""},{"$f":"IF(Inmeetformulier!K87=\"\",\"\",Inmeetformulier!K87)","v":""},{"$f":"IF(Inmeetformulier!L87=\"\",\"\",Inmeetformulier!L87)","v":""},{"$f":"IF(Inmeetformulier!M87=\"\",\"\",Inmeetformulier!M87)","v":""},{"$f":"IF(Inmeetformulier!N87=\"\",\"\",Inmeetformulier!N87)","v":""},{"$f":"IF(Inmeetformulier!O87=\"\",\"\",Inmeetformulier!O87)","v":""},{"$f":"IF(Inmeetformulier!B87=\"\",\"\",Inmeetformulier!B87)","v":""},{"$f":"IF(Inmeetformulier!S87=\"\",\"\",Inmeetformulier!S87)","v":""}]
[null,{"$f":"IF(Inmeetformulier!P88=\"\",\"\",Inmeetformulier!P88)","v":""},{"$f":"IF(Inmeetformulier!Q88=\"\",\"\",Inmeetformulier!Q88)","v":""},{"$f":"IF(Inmeetformulier!D88=\"\",\"\",Inmeetformulier!D88)","v":""},{"$f":"IF(Inmeetformulier!E88=\"\",\"\",Inmeetformulier!E88)","v":""},{"$f":"IF(Inmeetformulier!F88=\"\",\"\",Inmeetformulier!F88)","v":""},{"$f":"IF(Inmeetformulier!G88=\"\",\"\",Inmeetformulier!G88)","v":""},{"$f":"IF(Inmeetformulier!H88=\"\",\"\",Inmeetformulier!H88)","v":""},{"$f":"IF(Inmeetformulier!I88=\"\",\"\",Inmeetformulier!I88)","v":""},{"$f":"IF(Inmeetformulier!J88=\"\",\"\",Inmeetformulier!J88)","v":""},{"$f":"IF(Inmeetformulier!K88=\"\",\"\",Inmeetformulier!K88)","v":""},{"$f":"IF(Inmeetformulier!L88=\"\",\"\",Inmeetformulier!L88)","v":""},{"$f":"IF(Inmeetformulier!M88=\"\",\"\",Inmeetformulier!M88)","v":""},{"$f":"IF(Inmeetformulier!N88=\"\",\"\",Inmeetformulier!N88)","v":""},{"$f":"IF(Inmeetformulier!O88=\"\",\"\",Inmeetformulier!O88)","v":""},{"$f":"IF(Inmeetformulier!B88=\"\",\"\",Inmeetformulier!B88)","v":""},{"$f":"IF(Inmeetformulier!S88=\"\",\"\",Inmeetformulier!S88)","v":""}]
[null,{"$f":"IF(Inmeetformulier!P89=\"\",\"\",Inmeetformulier!P89)","v":""},{"$f":"IF(Inmeetformulier!Q89=\"\",\"\",Inmeetformulier!Q89)","v":""},{"$f":"IF(Inmeetformulier!D89=\"\",\"\",Inmeetformulier!D89)","v":""},{"$f":"IF(Inmeetformulier!E89=\"\",\"\",Inmeetformulier!E89)","v":""},{"$f":"IF(Inmeetformulier!F89=\"\",\"\",Inmeetformulier!F89)","v":""},{"$f":"IF(Inmeetformulier!G89=\"\",\"\",Inmeetformulier!G89)","v":""},{"$f":"IF(Inmeetformulier!H89=\"\",\"\",Inmeetformulier!H89)","v":""},{"$f":"IF(Inmeetformulier!I89=\"\",\"\",Inmeetformulier!I89)","v":""},{"$f":"IF(Inmeetformulier!J89=\"\",\"\",Inmeetformulier!J89)","v":""},{"$f":"IF(Inmeetformulier!K89=\"\",\"\",Inmeetformulier!K89)","v":""},{"$f":"IF(Inmeetformulier!L89=\"\",\"\",Inmeetformulier!L89)","v":""},{"$f":"IF(Inmeetformulier!M89=\"\",\"\",Inmeetformulier!M89)","v":""},{"$f":"IF(Inmeetformulier!N89=\"\",\"\",Inmeetformulier!N89)","v":""},{"$f":"IF(Inmeetformulier!O89=\"\",\"\",Inmeetformulier!O89)","v":""},{"$f":"IF(Inmeetformulier!B89=\"\",\"\",Inmeetformulier!B89)","v":""},{"$f":"IF(Inmeetformulier!S89=\"\",\"\",Inmeetformulier!S89)","v":""}]
[null,{"$f":"IF(Inmeetformulier!P90=\"\",\"\",Inmeetformulier!P90)","v":""},{"$f":"IF(Inmeetformulier!Q90=\"\",\"\",Inmeetformulier!Q90)","v":""},{"$f":"IF(Inmeetformulier!D90=\"\",\"\",Inmeetformulier!D90)","v":""},{"$f":"IF(Inmeetformulier!E90=\"\",\"\",Inmeetformulier!E90)","v":""},{"$f":"IF(Inmeetformulier!F90=\"\",\"\",Inmeetformulier!F90)","v":""},{"$f":"IF(Inmeetformulier!G90=\"\",\"\",Inmeetformulier!G90)","v":""},{"$f":"IF(Inmeetformulier!H90=\"\",\"\",Inmeetformulier!H90)","v":""},{"$f":"IF(Inmeetformulier!I90=\"\",\"\",Inmeetformulier!I90)","v":""},{"$f":"IF(Inmeetformulier!J90=\"\",\"\",Inmeetformulier!J90)","v":""},{"$f":"IF(Inmeetformulier!K90=\"\",\"\",Inmeetformulier!K90)","v":""},{"$f":"IF(Inmeetformulier!L90=\"\",\"\",Inmeetformulier!L90)","v":""},{"$f":"IF(Inmeetformulier!M90=\"\",\"\",Inmeetformulier!M90)","v":""},{"$f":"IF(Inmeetformulier!N90=\"\",\"\",Inmeetformulier!N90)","v":""},{"$f":"IF(Inmeetformulier!O90=\"\",\"\",Inmeetformulier!O90)","v":""},{"$f":"IF(Inmeetformulier!B90=\"\",\"\",Inmeetformulier!B90)","v":""},{"$f":"IF(Inmeetformulier!S90=\"\",\"\",Inmeetformulier!S90)","v":""}]
[null,{"$f":"IF(Inmeetformulier!P91=\"\",\"\",Inmeetformulier!P91)","v":""},{"$f":"IF(Inmeetformulier!Q91=\"\",\"\",Inmeetformulier!Q91)","v":""},{"$f":"IF(Inmeetformulier!D91=\"\",\"\",Inmeetformulier!D91)","v":""},{"$f":"IF(Inmeetformulier!E91=\"\",\"\",Inmeetformulier!E91)","v":""},{"$f":"IF(Inmeetformulier!F91=\"\",\"\",Inmeetformulier!F91)","v":""},{"$f":"IF(Inmeetformulier!G91=\"\",\"\",Inmeetformulier!G91)","v":""},{"$f":"IF(Inmeetformulier!H91=\"\",\"\",Inmeetformulier!H91)","v":""},{"$f":"IF(Inmeetformulier!I91=\"\",\"\",Inmeetformulier!I91)","v":""},{"$f":"IF(Inmeetformulier!J91=\"\",\"\",Inmeetformulier!J91)","v":""},{"$f":"IF(Inmeetformulier!K91=\"\",\"\",Inmeetformulier!K91)","v":""},{"$f":"IF(Inmeetformulier!L91=\"\",\"\",Inmeetformulier!L91)","v":""},{"$f":"IF(Inmeetformulier!M91=\"\",\"\",Inmeetformulier!M91)","v":""},{"$f":"IF(Inmeetformulier!N91=\"\",\"\",Inmeetformulier!N91)","v":""},{"$f":"IF(Inmeetformulier!O91=\"\",\"\",Inmeetformulier!O91)","v":""},{"$f":"IF(Inmeetformulier!B91=\"\",\"\",Inmeetformulier!B91)","v":""},{"$f":"IF(Inmeetformulier!S91=\"\",\"\",Inmeetformulier!S91)","v":""}]
[null,{"$f":"IF(Inmeetformulier!P92=\"\",\"\",Inmeetformulier!P92)","v":""},{"$f":"IF(Inmeetformulier!Q92=\"\",\"\",Inmeetformulier!Q92)","v":""},{"$f":"IF(Inmeetformulier!D92=\"\",\"\",Inmeetformulier!D92)","v":""},{"$f":"IF(Inmeetformulier!E92=\"\",\"\",Inmeetformulier!E92)","v":""},{"$f":"IF(Inmeetformulier!F92=\"\",\"\",Inmeetformulier!F92)","v":""},{"$f":"IF(Inmeetformulier!G92=\"\",\"\",Inmeetformulier!G92)","v":""},{"$f":"IF(Inmeetformulier!H92=\"\",\"\",Inmeetformulier!H92)","v":""},{"$f":"IF(Inmeetformulier!I92=\"\",\"\",Inmeetformulier!I92)","v":""},{"$f":"IF(Inmeetformulier!J92=\"\",\"\",Inmeetformulier!J92)","v":""},{"$f":"IF(Inmeetformulier!K92=\"\",\"\",Inmeetformulier!K92)","v":""},{"$f":"IF(Inmeetformulier!L92=\"\",\"\",Inmeetformulier!L92)","v":""},{"$f":"IF(Inmeetformulier!M92=\"\",\"\",Inmeetformulier!M92)","v":""},{"$f":"IF(Inmeetformulier!N92=\"\",\"\",Inmeetformulier!N92)","v":""},{"$f":"IF(Inmeetformulier!O92=\"\",\"\",Inmeetformulier!O92)","v":""},{"$f":"IF(Inmeetformulier!B92=\"\",\"\",Inmeetformulier!B92)","v":""},{"$f":"IF(Inmeetformulier!S92=\"\",\"\",Inmeetformulier!S92)","v":""}]
[null,{"$f":"IF(Inmeetformulier!P93=\"\",\"\",Inmeetformulier!P93)","v":""},{"$f":"IF(Inmeetformulier!Q93=\"\",\"\",Inmeetformulier!Q93)","v":""},{"$f":"IF(Inmeetformulier!D93=\"\",\"\",Inmeetformulier!D93)","v":""},{"$f":"IF(Inmeetformulier!E93=\"\",\"\",Inmeetformulier!E93)","v":""},{"$f":"IF(Inmeetformulier!F93=\"\",\"\",Inmeetformulier!F93)","v":""},{"$f":"IF(Inmeetformulier!G93=\"\",\"\",Inmeetformulier!G93)","v":""},{"$f":"IF(Inmeetformulier!H93=\"\",\"\",Inmeetformulier!H93)","v":""},{"$f":"IF(Inmeetformulier!I93=\"\",\"\",Inmeetformulier!I93)","v":""},{"$f":"IF(Inmeetformulier!J93=\"\",\"\",Inmeetformulier!J93)","v":""},{"$f":"IF(Inmeetformulier!K93=\"\",\"\",Inmeetformulier!K93)","v":""},{"$f":"IF(Inmeetformulier!L93=\"\",\"\",Inmeetformulier!L93)","v":""},{"$f":"IF(Inmeetformulier!M93=\"\",\"\",Inmeetformulier!M93)","v":""},{"$f":"IF(Inmeetformulier!N93=\"\",\"\",Inmeetformulier!N93)","v":""},{"$f":"IF(Inmeetformulier!O93=\"\",\"\",Inmeetformulier!O93)","v":""},{"$f":"IF(Inmeetformulier!B93=\"\",\"\",Inmeetformulier!B93)","v":""},{"$f":"IF(Inmeetformulier!S93=\"\",\"\",Inmeetformulier!S93)","v":""}]
[null,{"$f":"IF(Inmeetformulier!P94=\"\",\"\",Inmeetformulier!P94)","v":""},{"$f":"IF(Inmeetformulier!Q94=\"\",\"\",Inmeetformulier!Q94)","v":""},{"$f":"IF(Inmeetformulier!D94=\"\",\"\",Inmeetformulier!D94)","v":""},{"$f":"IF(Inmeetformulier!E94=\"\",\"\",Inmeetformulier!E94)","v":""},{"$f":"IF(Inmeetformulier!F94=\"\",\"\",Inmeetformulier!F94)","v":""},{"$f":"IF(Inmeetformulier!G94=\"\",\"\",Inmeetformulier!G94)","v":""},{"$f":"IF(Inmeetformulier!H94=\"\",\"\",Inmeetformulier!H94)","v":""},{"$f":"IF(Inmeetformulier!I94=\"\",\"\",Inmeetformulier!I94)","v":""},{"$f":"IF(Inmeetformulier!J94=\"\",\"\",Inmeetformulier!J94)","v":""},{"$f":"IF(Inmeetformulier!K94=\"\",\"\",Inmeetformulier!K94)","v":""},{"$f":"IF(Inmeetformulier!L94=\"\",\"\",Inmeetformulier!L94)","v":""},{"$f":"IF(Inmeetformulier!M94=\"\",\"\",Inmeetformulier!M94)","v":""},{"$f":"IF(Inmeetformulier!N94=\"\",\"\",Inmeetformulier!N94)","v":""},{"$f":"IF(Inmeetformulier!O94=\"\",\"\",Inmeetformulier!O94)","v":""},{"$f":"IF(Inmeetformulier!B94=\"\",\"\",Inmeetformulier!B94)","v":""},{"$f":"IF(Inmeetformulier!S94=\"\",\"\",Inmeetformulier!S94)","v":""}]
[null,{"$f":"IF(Inmeetformulier!P95=\"\",\"\",Inmeetformulier!P95)","v":""},{"$f":"IF(Inmeetformulier!Q95=\"\",\"\",Inmeetformulier!Q95)","v":""},{"$f":"IF(Inmeetformulier!D95=\"\",\"\",Inmeetformulier!D95)","v":""},{"$f":"IF(Inmeetformulier!E95=\"\",\"\",Inmeetformulier!E95)","v":""},{"$f":"IF(Inmeetformulier!F95=\"\",\"\",Inmeetformulier!F95)","v":""},{"$f":"IF(Inmeetformulier!G95=\"\",\"\",Inmeetformulier!G95)","v":""},{"$f":"IF(Inmeetformulier!H95=\"\",\"\",Inmeetformulier!H95)","v":""},{"$f":"IF(Inmeetformulier!I95=\"\",\"\",Inmeetformulier!I95)","v":""},{"$f":"IF(Inmeetformulier!J95=\"\",\"\",Inmeetformulier!J95)","v":""},{"$f":"IF(Inmeetformulier!K95=\"\",\"\",Inmeetformulier!K95)","v":""},{"$f":"IF(Inmeetformulier!L95=\"\",\"\",Inmeetformulier!L95)","v":""},{"$f":"IF(Inmeetformulier!M95=\"\",\"\",Inmeetformulier!M95)","v":""},{"$f":"IF(Inmeetformulier!N95=\"\",\"\",Inmeetformulier!N95)","v":""},{"$f":"IF(Inmeetformulier!O95=\"\",\"\",Inmeetformulier!O95)","v":""},{"$f":"IF(Inmeetformulier!B95=\"\",\"\",Inmeetformulier!B95)","v":""},{"$f":"IF(Inmeetformulier!S95=\"\",\"\",Inmeetformulier!S95)","v":""}]
[null,{"$f":"IF(Inmeetformulier!P96=\"\",\"\",Inmeetformulier!P96)","v":""},{"$f":"IF(Inmeetformulier!Q96=\"\",\"\",Inmeetformulier!Q96)","v":""},{"$f":"IF(Inmeetformulier!D96=\"\",\"\",Inmeetformulier!D96)","v":""},{"$f":"IF(Inmeetformulier!E96=\"\",\"\",Inmeetformulier!E96)","v":""},{"$f":"IF(Inmeetformulier!F96=\"\",\"\",Inmeetformulier!F96)","v":""},{"$f":"IF(Inmeetformulier!G96=\"\",\"\",Inmeetformulier!G96)","v":""},{"$f":"IF(Inmeetformulier!H96=\"\",\"\",Inmeetformulier!H96)","v":""},{"$f":"IF(Inmeetformulier!I96=\"\",\"\",Inmeetformulier!I96)","v":""},{"$f":"IF(Inmeetformulier!J96=\"\",\"\",Inmeetformulier!J96)","v":""},{"$f":"IF(Inmeetformulier!K96=\"\",\"\",Inmeetformulier!K96)","v":""},{"$f":"IF(Inmeetformulier!L96=\"\",\"\",Inmeetformulier!L96)","v":""},{"$f":"IF(Inmeetformulier!M96=\"\",\"\",Inmeetformulier!M96)","v":""},{"$f":"IF(Inmeetformulier!N96=\"\",\"\",Inmeetformulier!N96)","v":""},{"$f":"IF(Inmeetformulier!O96=\"\",\"\",Inmeetformulier!O96)","v":""},{"$f":"IF(Inmeetformulier!B96=\"\",\"\",Inmeetformulier!B96)","v":""},{"$f":"IF(Inmeetformulier!S96=\"\",\"\",Inmeetformulier!S96)","v":""}]
[null,{"$f":"IF(Inmeetformulier!P97=\"\",\"\",Inmeetformulier!P97)","v":""},{"$f":"IF(Inmeetformulier!Q97=\"\",\"\",Inmeetformulier!Q97)","v":""},{"$f":"IF(Inmeetformulier!D97=\"\",\"\",Inmeetformulier!D97)","v":""},{"$f":"IF(Inmeetformulier!E97=\"\",\"\",Inmeetformulier!E97)","v":""},{"$f":"IF(Inmeetformulier!F97=\"\",\"\",Inmeetformulier!F97)","v":""},{"$f":"IF(Inmeetformulier!G97=\"\",\"\",Inmeetformulier!G97)","v":""},{"$f":"IF(Inmeetformulier!H97=\"\",\"\",Inmeetformulier!H97)","v":""},{"$f":"IF(Inmeetformulier!I97=\"\",\"\",Inmeetformulier!I97)","v":""},{"$f":"IF(Inmeetformulier!J97=\"\",\"\",Inmeetformulier!J97)","v":""},{"$f":"IF(Inmeetformulier!K97=\"\",\"\",Inmeetformulier!K97)","v":""},{"$f":"IF(Inmeetformulier!L97=\"\",\"\",Inmeetformulier!L97)","v":""},{"$f":"IF(Inmeetformulier!M97=\"\",\"\",Inmeetformulier!M97)","v":""},{"$f":"IF(Inmeetformulier!N97=\"\",\"\",Inmeetformulier!N97)","v":""},{"$f":"IF(Inmeetformulier!O97=\"\",\"\",Inmeetformulier!O97)","v":""},{"$f":"IF(Inmeetformulier!B97=\"\",\"\",Inmeetformulier!B97)","v":""},{"$f":"IF(Inmeetformulier!S97=\"\",\"\",Inmeetformulier!S97)","v":""}]
[null,{"$f":"IF(Inmeetformulier!P98=\"\",\"\",Inmeetformulier!P98)","v":""},{"$f":"IF(Inmeetformulier!Q98=\"\",\"\",Inmeetformulier!Q98)","v":""},{"$f":"IF(Inmeetformulier!D98=\"\",\"\",Inmeetformulier!D98)","v":""},{"$f":"IF(Inmeetformulier!E98=\"\",\"\",Inmeetformulier!E98)","v":""},{"$f":"IF(Inmeetformulier!F98=\"\",\"\",Inmeetformulier!F98)","v":""},{"$f":"IF(Inmeetformulier!G98=\"\",\"\",Inmeetformulier!G98)","v":""},{"$f":"IF(Inmeetformulier!H98=\"\",\"\",Inmeetformulier!H98)","v":""},{"$f":"IF(Inmeetformulier!I98=\"\",\"\",Inmeetformulier!I98)","v":""},{"$f":"IF(Inmeetformulier!J98=\"\",\"\",Inmeetformulier!J98)","v":""},{"$f":"IF(Inmeetformulier!K98=\"\",\"\",Inmeetformulier!K98)","v":""},{"$f":"IF(Inmeetformulier!L98=\"\",\"\",Inmeetformulier!L98)","v":""},{"$f":"IF(Inmeetformulier!M98=\"\",\"\",Inmeetformulier!M98)","v":""},{"$f":"IF(Inmeetformulier!N98=\"\",\"\",Inmeetformulier!N98)","v":""},{"$f":"IF(Inmeetformulier!O98=\"\",\"\",Inmeetformulier!O98)","v":""},{"$f":"IF(Inmeetformulier!B98=\"\",\"\",Inmeetformulier!B98)","v":""},{"$f":"IF(Inmeetformulier!S98=\"\",\"\",Inmeetformulier!S98)","v":""}]
[null,{"$f":"IF(Inmeetformulier!P99=\"\",\"\",Inmeetformulier!P99)","v":""},{"$f":"IF(Inmeetformulier!Q99=\"\",\"\",Inmeetformulier!Q99)","v":""},{"$f":"IF(Inmeetformulier!D99=\"\",\"\",Inmeetformulier!D99)","v":""},{"$f":"IF(Inmeetformulier!E99=\"\",\"\",Inmeetformulier!E99)","v":""},{"$f":"IF(Inmeetformulier!F99=\"\",\"\",Inmeetformulier!F99)","v":""},{"$f":"IF(Inmeetformulier!G99=\"\",\"\",Inmeetformulier!G99)","v":""},{"$f":"IF(Inmeetformulier!H99=\"\",\"\",Inmeetformulier!H99)","v":""},{"$f":"IF(Inmeetformulier!I99=\"\",\"\",Inmeetformulier!I99)","v":""},{"$f":"IF(Inmeetformulier!J99=\"\",\"\",Inmeetformulier!J99)","v":""},{"$f":"IF(Inmeetformulier!K99=\"\",\"\",Inmeetformulier!K99)","v":""},{"$f":"IF(Inmeetformulier!L99=\"\",\"\",Inmeetformulier!L99)","v":""},{"$f":"IF(Inmeetformulier!M99=\"\",\"\",Inmeetformulier!M99)","v":""},{"$f":"IF(Inmeetformulier!N99=\"\",\"\",Inmeetformulier!N99)","v":""},{"$f":"IF(Inmeetformulier!O99=\"\",\"\",Inmeetformulier!O99)","v":""},{"$f":"IF(Inmeetformulier!B99=\"\",\"\",Inmeetformulier!B99)","v":""},{"$f":"IF(Inmeetformulier!S99=\"\",\"\",Inmeetformulier!S99)","v":""}]
[null,{"$f":"IF(Inmeetformulier!P100=\"\",\"\",Inmeetformulier!P100)","v":""},{"$f":"IF(Inmeetformulier!Q100=\"\",\"\",Inmeetformulier!Q100)","v":""},{"$f":"IF(Inmeetformulier!D100=\"\",\"\",Inmeetformulier!D100)","v":""},{"$f":"IF(Inmeetformulier!E100=\"\",\"\",Inmeetformulier!E100)","v":""},{"$f":"IF(Inmeetformulier!F100=\"\",\"\",Inmeetformulier!F100)","v":""},{"$f":"IF(Inmeetformulier!G100=\"\",\"\",Inmeetformulier!G100)","v":""},{"$f":"IF(Inmeetformulier!H100=\"\",\"\",Inmeetformulier!H100)","v":""},{"$f":"IF(Inmeetformulier!I100=\"\",\"\",Inmeetformulier!I100)","v":""},{"$f":"IF(Inmeetformulier!J100=\"\",\"\",Inmeetformulier!J100)","v":""},{"$f":"IF(Inmeetformulier!K100=\"\",\"\",Inmeetformulier!K100)","v":""},{"$f":"IF(Inmeetformulier!L100=\"\",\"\",Inmeetformulier!L100)","v":""},{"$f":"IF(Inmeetformulier!M100=\"\",\"\",Inmeetformulier!M100)","v":""},{"$f":"IF(Inmeetformulier!N100=\"\",\"\",Inmeetformulier!N100)","v":""},{"$f":"IF(Inmeetformulier!O100=\"\",\"\",Inmeetformulier!O100)","v":""},{"$f":"IF(Inmeetformulier!B100=\"\",\"\",Inmeetformulier!B100)","v":""},{"$f":"IF(Inmeetformulier!S100=\"\",\"\",Inmeetformulier!S100)","v":""}]
[null,{"$f":"IF(Inmeetformulier!P101=\"\",\"\",Inmeetformulier!P101)","v":""},{"$f":"IF(Inmeetformulier!Q101=\"\",\"\",Inmeetformulier!Q101)","v":""},{"$f":"IF(Inmeetformulier!D101=\"\",\"\",Inmeetformulier!D101)","v":""},{"$f":"IF(Inmeetformulier!E101=\"\",\"\",Inmeetformulier!E101)","v":""},{"$f":"IF(Inmeetformulier!F101=\"\",\"\",Inmeetformulier!F101)","v":""},{"$f":"IF(Inmeetformulier!G101=\"\",\"\",Inmeetformulier!G101)","v":""},{"$f":"IF(Inmeetformulier!H101=\"\",\"\",Inmeetformulier!H101)","v":""},{"$f":"IF(Inmeetformulier!I101=\"\",\"\",Inmeetformulier!I101)","v":""},{"$f":"IF(Inmeetformulier!J101=\"\",\"\",Inmeetformulier!J101)","v":""},{"$f":"IF(Inmeetformulier!K101=\"\",\"\",Inmeetformulier!K101)","v":""},{"$f":"IF(Inmeetformulier!L101=\"\",\"\",Inmeetformulier!L101)","v":""},{"$f":"IF(Inmeetformulier!M101=\"\",\"\",Inmeetformulier!M101)","v":""},{"$f":"IF(Inmeetformulier!N101=\"\",\"\",Inmeetformulier!N101)","v":""},{"$f":"IF(Inmeetformulier!O101=\"\",\"\",Inmeetformulier!O101)","v":""},{"$f":"IF(Inmeetformulier!B101=\"\",\"\",Inmeetformulier!B101)","v":""},{"$f":"IF(Inmeetformulier!S101=\"\",\"\",Inmeetformulier!S101)","v":""}]
[null,{"$f":"IF(Inmeetformulier!P102=\"\",\"\",Inmeetformulier!P102)","v":""},{"$f":"IF(Inmeetformulier!Q102=\"\",\"\",Inmeetformulier!Q102)","v":""},{"$f":"IF(Inmeetformulier!D102=\"\",\"\",Inmeetformulier!D102)","v":""},{"$f":"IF(Inmeetformulier!E102=\"\",\"\",Inmeetformulier!E102)","v":""},{"$f":"IF(Inmeetformulier!F102=\"\",\"\",Inmeetformulier!F102)","v":""},{"$f":"IF(Inmeetformulier!G102=\"\",\"\",Inmeetformulier!G102)","v":""},{"$f":"IF(Inmeetformulier!H102=\"\",\"\",Inmeetformulier!H102)","v":""},{"$f":"IF(Inmeetformulier!I102=\"\",\"\",Inmeetformulier!I102)","v":""},{"$f":"IF(Inmeetformulier!J102=\"\",\"\",Inmeetformulier!J102)","v":""},{"$f":"IF(Inmeetformulier!K102=\"\",\"\",Inmeetformulier!K102)","v":""},{"$f":"IF(Inmeetformulier!L102=\"\",\"\",Inmeetformulier!L102)","v":""},{"$f":"IF(Inmeetformulier!M102=\"\",\"\",Inmeetformulier!M102)","v":""},{"$f":"IF(Inmeetformulier!N102=\"\",\"\",Inmeetformulier!N102)","v":""},{"$f":"IF(Inmeetformulier!O102=\"\",\"\",Inmeetformulier!O102)","v":""},{"$f":"IF(Inmeetformulier!B102=\"\",\"\",Inmeetformulier!B102)","v":""},{"$f":"IF(Inmeetformulier!S102=\"\",\"\",Inmeetformulier!S102)","v":""}]
[null,{"$f":"IF(Inmeetformulier!P103=\"\",\"\",Inmeetformulier!P103)","v":""},{"$f":"IF(Inmeetformulier!Q103=\"\",\"\",Inmeetformulier!Q103)","v":""},{"$f":"IF(Inmeetformulier!D103=\"\",\"\",Inmeetformulier!D103)","v":""},{"$f":"IF(Inmeetformulier!E103=\"\",\"\",Inmeetformulier!E103)","v":""},{"$f":"IF(Inmeetformulier!F103=\"\",\"\",Inmeetformulier!F103)","v":""},{"$f":"IF(Inmeetformulier!G103=\"\",\"\",Inmeetformulier!G103)","v":""},{"$f":"IF(Inmeetformulier!H103=\"\",\"\",Inmeetformulier!H103)","v":""},{"$f":"IF(Inmeetformulier!I103=\"\",\"\",Inmeetformulier!I103)","v":""},{"$f":"IF(Inmeetformulier!J103=\"\",\"\",Inmeetformulier!J103)","v":""},{"$f":"IF(Inmeetformulier!K103=\"\",\"\",Inmeetformulier!K103)","v":""},{"$f":"IF(Inmeetformulier!L103=\"\",\"\",Inmeetformulier!L103)","v":""},{"$f":"IF(Inmeetformulier!M103=\"\",\"\",Inmeetformulier!M103)","v":""},{"$f":"IF(Inmeetformulier!N103=\"\",\"\",Inmeetformulier!N103)","v":""},{"$f":"IF(Inmeetformulier!O103=\"\",\"\",Inmeetformulier!O103)","v":""},{"$f":"IF(Inmeetformulier!B103=\"\",\"\",Inmeetformulier!B103)","v":""},{"$f":"IF(Inmeetformulier!S103=\"\",\"\",Inmeetformulier!S103)","v":""}]
[null,{"$f":"IF(Inmeetformulier!P104=\"\",\"\",Inmeetformulier!P104)","v":""},{"$f":"IF(Inmeetformulier!Q104=\"\",\"\",Inmeetformulier!Q104)","v":""},{"$f":"IF(Inmeetformulier!D104=\"\",\"\",Inmeetformulier!D104)","v":""},{"$f":"IF(Inmeetformulier!E104=\"\",\"\",Inmeetformulier!E104)","v":""},{"$f":"IF(Inmeetformulier!F104=\"\",\"\",Inmeetformulier!F104)","v":""},{"$f":"IF(Inmeetformulier!G104=\"\",\"\",Inmeetformulier!G104)","v":""},{"$f":"IF(Inmeetformulier!H104=\"\",\"\",Inmeetformulier!H104)","v":""},{"$f":"IF(Inmeetformulier!I104=\"\",\"\",Inmeetformulier!I104)","v":""},{"$f":"IF(Inmeetformulier!J104=\"\",\"\",Inmeetformulier!J104)","v":""},{"$f":"IF(Inmeetformulier!K104=\"\",\"\",Inmeetformulier!K104)","v":""},{"$f":"IF(Inmeetformulier!L104=\"\",\"\",Inmeetformulier!L104)","v":""},{"$f":"IF(Inmeetformulier!M104=\"\",\"\",Inmeetformulier!M104)","v":""},{"$f":"IF(Inmeetformulier!N104=\"\",\"\",Inmeetformulier!N104)","v":""},{"$f":"IF(Inmeetformulier!O104=\"\",\"\",Inmeetformulier!O104)","v":""},{"$f":"IF(Inmeetformulier!B104=\"\",\"\",Inmeetformulier!B104)","v":""},{"$f":"IF(Inmeetformulier!S104=\"\",\"\",Inmeetformulier!S104)","v":""}]
[null,{"$f":"IF(Inmeetformulier!P105=\"\",\"\",Inmeetformulier!P105)","v":""},{"$f":"IF(Inmeetformulier!Q105=\"\",\"\",Inmeetformulier!Q105)","v":""},{"$f":"IF(Inmeetformulier!D105=\"\",\"\",Inmeetformulier!D105)","v":""},{"$f":"IF(Inmeetformulier!E105=\"\",\"\",Inmeetformulier!E105)","v":""},{"$f":"IF(Inmeetformulier!F105=\"\",\"\",Inmeetformulier!F105)","v":""},{"$f":"IF(Inmeetformulier!G105=\"\",\"\",Inmeetformulier!G105)","v":""},{"$f":"IF(Inmeetformulier!H105=\"\",\"\",Inmeetformulier!H105)","v":""},{"$f":"IF(Inmeetformulier!I105=\"\",\"\",Inmeetformulier!I105)","v":""},{"$f":"IF(Inmeetformulier!J105=\"\",\"\",Inmeetformulier!J105)","v":""},{"$f":"IF(Inmeetformulier!K105=\"\",\"\",Inmeetformulier!K105)","v":""},{"$f":"IF(Inmeetformulier!L105=\"\",\"\",Inmeetformulier!L105)","v":""},{"$f":"IF(Inmeetformulier!M105=\"\",\"\",Inmeetformulier!M105)","v":""},{"$f":"IF(Inmeetformulier!N105=\"\",\"\",Inmeetformulier!N105)","v":""},{"$f":"IF(Inmeetformulier!O105=\"\",\"\",Inmeetformulier!O105)","v":""},{"$f":"IF(Inmeetformulier!B105=\"\",\"\",Inmeetformulier!B105)","v":""},{"$f":"IF(Inmeetformulier!S105=\"\",\"\",Inmeetformulier!S105)","v":""}]
[null,{"$f":"IF(Inmeetformulier!P106=\"\",\"\",Inmeetformulier!P106)","v":""},{"$f":"IF(Inmeetformulier!Q106=\"\",\"\",Inmeetformulier!Q106)","v":""},{"$f":"IF(Inmeetformulier!D106=\"\",\"\",Inmeetformulier!D106)","v":""},{"$f":"IF(Inmeetformulier!E106=\"\",\"\",Inmeetformulier!E106)","v":""},{"$f":"IF(Inmeetformulier!F106=\"\",\"\",Inmeetformulier!F106)","v":""},{"$f":"IF(Inmeetformulier!G106=\"\",\"\",Inmeetformulier!G106)","v":""},{"$f":"IF(Inmeetformulier!H106=\"\",\"\",Inmeetformulier!H106)","v":""},{"$f":"IF(Inmeetformulier!I106=\"\",\"\",Inmeetformulier!I106)","v":""},{"$f":"IF(Inmeetformulier!J106=\"\",\"\",Inmeetformulier!J106)","v":""},{"$f":"IF(Inmeetformulier!K106=\"\",\"\",Inmeetformulier!K106)","v":""},{"$f":"IF(Inmeetformulier!L106=\"\",\"\",Inmeetformulier!L106)","v":""},{"$f":"IF(Inmeetformulier!M106=\"\",\"\",Inmeetformulier!M106)","v":""},{"$f":"IF(Inmeetformulier!N106=\"\",\"\",Inmeetformulier!N106)","v":""},{"$f":"IF(Inmeetformulier!O106=\"\",\"\",Inmeetformulier!O106)","v":""},{"$f":"IF(Inmeetformulier!B106=\"\",\"\",Inmeetformulier!B106)","v":""},{"$f":"IF(Inmeetformulier!S106=\"\",\"\",Inmeetformulier!S106)","v":""}]
[null,{"$f":"IF(Inmeetformulier!P107=\"\",\"\",Inmeetformulier!P107)","v":""},{"$f":"IF(Inmeetformulier!Q107=\"\",\"\",Inmeetformulier!Q107)","v":""},{"$f":"IF(Inmeetformulier!D107=\"\",\"\",Inmeetformulier!D107)","v":""},{"$f":"IF(Inmeetformulier!E107=\"\",\"\",Inmeetformulier!E107)","v":""},{"$f":"IF(Inmeetformulier!F107=\"\",\"\",Inmeetformulier!F107)","v":""},{"$f":"IF(Inmeetformulier!G107=\"\",\"\",Inmeetformulier!G107)","v":""},{"$f":"IF(Inmeetformulier!H107=\"\",\"\",Inmeetformulier!H107)","v":""},{"$f":"IF(Inmeetformulier!I107=\"\",\"\",Inmeetformulier!I107)","v":""},{"$f":"IF(Inmeetformulier!J107=\"\",\"\",Inmeetformulier!J107)","v":""},{"$f":"IF(Inmeetformulier!K107=\"\",\"\",Inmeetformulier!K107)","v":""},{"$f":"IF(Inmeetformulier!L107=\"\",\"\",Inmeetformulier!L107)","v":""},{"$f":"IF(Inmeetformulier!M107=\"\",\"\",Inmeetformulier!M107)","v":""},{"$f":"IF(Inmeetformulier!N107=\"\",\"\",Inmeetformulier!N107)","v":""},{"$f":"IF(Inmeetformulier!O107=\"\",\"\",Inmeetformulier!O107)","v":""},{"$f":"IF(Inmeetformulier!B107=\"\",\"\",Inmeetformulier!B107)","v":""},{"$f":"IF(Inmeetformulier!S107=\"\",\"\",Inmeetformulier!S107)","v":""}]
[null,{"$f":"IF(Inmeetformulier!P108=\"\",\"\",Inmeetformulier!P108)","v":""},{"$f":"IF(Inmeetformulier!Q108=\"\",\"\",Inmeetformulier!Q108)","v":""},{"$f":"IF(Inmeetformulier!D108=\"\",\"\",Inmeetformulier!D108)","v":""},{"$f":"IF(Inmeetformulier!E108=\"\",\"\",Inmeetformulier!E108)","v":""},{"$f":"IF(Inmeetformulier!F108=\"\",\"\",Inmeetformulier!F108)","v":""},{"$f":"IF(Inmeetformulier!G108=\"\",\"\",Inmeetformulier!G108)","v":""},{"$f":"IF(Inmeetformulier!H108=\"\",\"\",Inmeetformulier!H108)","v":""},{"$f":"IF(Inmeetformulier!I108=\"\",\"\",Inmeetformulier!I108)","v":""},{"$f":"IF(Inmeetformulier!J108=\"\",\"\",Inmeetformulier!J108)","v":""},{"$f":"IF(Inmeetformulier!K108=\"\",\"\",Inmeetformulier!K108)","v":""},{"$f":"IF(Inmeetformulier!L108=\"\",\"\",Inmeetformulier!L108)","v":""},{"$f":"IF(Inmeetformulier!M108=\"\",\"\",Inmeetformulier!M108)","v":""},{"$f":"IF(Inmeetformulier!N108=\"\",\"\",Inmeetformulier!N108)","v":""},{"$f":"IF(Inmeetformulier!O108=\"\",\"\",Inmeetformulier!O108)","v":""},{"$f":"IF(Inmeetformulier!B108=\"\",\"\",Inmeetformulier!B108)","v":""},{"$f":"IF(Inmeetformulier!S108=\"\",\"\",Inmeetformulier!S108)","v":""}]
[null,{"$f":"IF(Inmeetformulier!P109=\"\",\"\",Inmeetformulier!P109)","v":""},{"$f":"IF(Inmeetformulier!Q109=\"\",\"\",Inmeetformulier!Q109)","v":""},{"$f":"IF(Inmeetformulier!D109=\"\",\"\",Inmeetformulier!D109)","v":""},{"$f":"IF(Inmeetformulier!E109=\"\",\"\",Inmeetformulier!E109)","v":""},{"$f":"IF(Inmeetformulier!F109=\"\",\"\",Inmeetformulier!F109)","v":""},{"$f":"IF(Inmeetformulier!G109=\"\",\"\",Inmeetformulier!G109)","v":""},{"$f":"IF(Inmeetformulier!H109=\"\",\"\",Inmeetformulier!H109)","v":""},{"$f":"IF(Inmeetformulier!I109=\"\",\"\",Inmeetformulier!I109)","v":""},{"$f":"IF(Inmeetformulier!J109=\"\",\"\",Inmeetformulier!J109)","v":""},{"$f":"IF(Inmeetformulier!K109=\"\",\"\",Inmeetformulier!K109)","v":""},{"$f":"IF(Inmeetformulier!L109=\"\",\"\",Inmeetformulier!L109)","v":""},{"$f":"IF(Inmeetformulier!M109=\"\",\"\",Inmeetformulier!M109)","v":""},{"$f":"IF(Inmeetformulier!N109=\"\",\"\",Inmeetformulier!N109)","v":""},{"$f":"IF(Inmeetformulier!O109=\"\",\"\",Inmeetformulier!O109)","v":""},{"$f":"IF(Inmeetformulier!B109=\"\",\"\",Inmeetformulier!B109)","v":""},{"$f":"IF(Inmeetformulier!S109=\"\",\"\",Inmeetformulier!S109)","v":""}]
[null,{"$f":"IF(Inmeetformulier!P110=\"\",\"\",Inmeetformulier!P110)","v":""},{"$f":"IF(Inmeetformulier!Q110=\"\",\"\",Inmeetformulier!Q110)","v":""},{"$f":"IF(Inmeetformulier!D110=\"\",\"\",Inmeetformulier!D110)","v":""},{"$f":"IF(Inmeetformulier!E110=\"\",\"\",Inmeetformulier!E110)","v":""},{"$f":"IF(Inmeetformulier!F110=\"\",\"\",Inmeetformulier!F110)","v":""},{"$f":"IF(Inmeetformulier!G110=\"\",\"\",Inmeetformulier!G110)","v":""},{"$f":"IF(Inmeetformulier!H110=\"\",\"\",Inmeetformulier!H110)","v":""},{"$f":"IF(Inmeetformulier!I110=\"\",\"\",Inmeetformulier!I110)","v":""},{"$f":"IF(Inmeetformulier!J110=\"\",\"\",Inmeetformulier!J110)","v":""},{"$f":"IF(Inmeetformulier!K110=\"\",\"\",Inmeetformulier!K110)","v":""},{"$f":"IF(Inmeetformulier!L110=\"\",\"\",Inmeetformulier!L110)","v":""},{"$f":"IF(Inmeetformulier!M110=\"\",\"\",Inmeetformulier!M110)","v":""},{"$f":"IF(Inmeetformulier!N110=\"\",\"\",Inmeetformulier!N110)","v":""},{"$f":"IF(Inmeetformulier!O110=\"\",\"\",Inmeetformulier!O110)","v":""},{"$f":"IF(Inmeetformulier!B110=\"\",\"\",Inmeetformulier!B110)","v":""},{"$f":"IF(Inmeetformulier!S110=\"\",\"\",Inmeetformulier!S110)","v":""}]
[null,{"$f":"IF(Inmeetformulier!P111=\"\",\"\",Inmeetformulier!P111)","v":""},{"$f":"IF(Inmeetformulier!Q111=\"\",\"\",Inmeetformulier!Q111)","v":""},{"$f":"IF(Inmeetformulier!D111=\"\",\"\",Inmeetformulier!D111)","v":""},{"$f":"IF(Inmeetformulier!E111=\"\",\"\",Inmeetformulier!E111)","v":""},{"$f":"IF(Inmeetformulier!F111=\"\",\"\",Inmeetformulier!F111)","v":""},{"$f":"IF(Inmeetformulier!G111=\"\",\"\",Inmeetformulier!G111)","v":""},{"$f":"IF(Inmeetformulier!H111=\"\",\"\",Inmeetformulier!H111)","v":""},{"$f":"IF(Inmeetformulier!I111=\"\",\"\",Inmeetformulier!I111)","v":""},{"$f":"IF(Inmeetformulier!J111=\"\",\"\",Inmeetformulier!J111)","v":""},{"$f":"IF(Inmeetformulier!K111=\"\",\"\",Inmeetformulier!K111)","v":""},{"$f":"IF(Inmeetformulier!L111=\"\",\"\",Inmeetformulier!L111)","v":""},{"$f":"IF(Inmeetformulier!M111=\"\",\"\",Inmeetformulier!M111)","v":""},{"$f":"IF(Inmeetformulier!N111=\"\",\"\",Inmeetformulier!N111)","v":""},{"$f":"IF(Inmeetformulier!O111=\"\",\"\",Inmeetformulier!O111)","v":""},{"$f":"IF(Inmeetformulier!B111=\"\",\"\",Inmeetformulier!B111)","v":""},{"$f":"IF(Inmeetformulier!S111=\"\",\"\",Inmeetformulier!S111)","v":""}]
[null,{"$f":"IF(Inmeetformulier!P112=\"\",\"\",Inmeetformulier!P112)","v":""},{"$f":"IF(Inmeetformulier!Q112=\"\",\"\",Inmeetformulier!Q112)","v":""},{"$f":"IF(Inmeetformulier!D112=\"\",\"\",Inmeetformulier!D112)","v":""},{"$f":"IF(Inmeetformulier!E112=\"\",\"\",Inmeetformulier!E112)","v":""},{"$f":"IF(Inmeetformulier!F112=\"\",\"\",Inmeetformulier!F112)","v":""},{"$f":"IF(Inmeetformulier!G112=\"\",\"\",Inmeetformulier!G112)","v":""},{"$f":"IF(Inmeetformulier!H112=\"\",\"\",Inmeetformulier!H112)","v":""},{"$f":"IF(Inmeetformulier!I112=\"\",\"\",Inmeetformulier!I112)","v":""},{"$f":"IF(Inmeetformulier!J112=\"\",\"\",Inmeetformulier!J112)","v":""},{"$f":"IF(Inmeetformulier!K112=\"\",\"\",Inmeetformulier!K112)","v":""},{"$f":"IF(Inmeetformulier!L112=\"\",\"\",Inmeetformulier!L112)","v":""},{"$f":"IF(Inmeetformulier!M112=\"\",\"\",Inmeetformulier!M112)","v":""},{"$f":"IF(Inmeetformulier!N112=\"\",\"\",Inmeetformulier!N112)","v":""},{"$f":"IF(Inmeetformulier!O112=\"\",\"\",Inmeetformulier!O112)","v":""},{"$f":"IF(Inmeetformulier!B112=\"\",\"\",Inmeetformulier!B112)","v":""},{"$f":"IF(Inmeetformulier!S112=\"\",\"\",Inmeetformulier!S112)","v":""}]
[null,{"$f":"IF(Inmeetformulier!P113=\"\",\"\",Inmeetformulier!P113)","v":""},{"$f":"IF(Inmeetformulier!Q113=\"\",\"\",Inmeetformulier!Q113)","v":""},{"$f":"IF(Inmeetformulier!D113=\"\",\"\",Inmeetformulier!D113)","v":""},{"$f":"IF(Inmeetformulier!E113=\"\",\"\",Inmeetformulier!E113)","v":""},{"$f":"IF(Inmeetformulier!F113=\"\",\"\",Inmeetformulier!F113)","v":""},{"$f":"IF(Inmeetformulier!G113=\"\",\"\",Inmeetformulier!G113)","v":""},{"$f":"IF(Inmeetformulier!H113=\"\",\"\",Inmeetformulier!H113)","v":""},{"$f":"IF(Inmeetformulier!I113=\"\",\"\",Inmeetformulier!I113)","v":""},{"$f":"IF(Inmeetformulier!J113=\"\",\"\",Inmeetformulier!J113)","v":""},{"$f":"IF(Inmeetformulier!K113=\"\",\"\",Inmeetformulier!K113)","v":""},{"$f":"IF(Inmeetformulier!L113=\"\",\"\",Inmeetformulier!L113)","v":""},{"$f":"IF(Inmeetformulier!M113=\"\",\"\",Inmeetformulier!M113)","v":""},{"$f":"IF(Inmeetformulier!N113=\"\",\"\",Inmeetformulier!N113)","v":""},{"$f":"IF(Inmeetformulier!O113=\"\",\"\",Inmeetformulier!O113)","v":""},{"$f":"IF(Inmeetformulier!B113=\"\",\"\",Inmeetformulier!B113)","v":""},{"$f":"IF(Inmeetformulier!S113=\"\",\"\",Inmeetformulier!S113)","v":""}]
[null,{"$f":"IF(Inmeetformulier!P114=\"\",\"\",Inmeetformulier!P114)","v":""},{"$f":"IF(Inmeetformulier!Q114=\"\",\"\",Inmeetformulier!Q114)","v":""},{"$f":"IF(Inmeetformulier!D114=\"\",\"\",Inmeetformulier!D114)","v":""},{"$f":"IF(Inmeetformulier!E114=\"\",\"\",Inmeetformulier!E114)","v":""},{"$f":"IF(Inmeetformulier!F114=\"\",\"\",Inmeetformulier!F114)","v":""},{"$f":"IF(Inmeetformulier!G114=\"\",\"\",Inmeetformulier!G114)","v":""},{"$f":"IF(Inmeetformulier!H114=\"\",\"\",Inmeetformulier!H114)","v":""},{"$f":"IF(Inmeetformulier!I114=\"\",\"\",Inmeetformulier!I114)","v":""},{"$f":"IF(Inmeetformulier!J114=\"\",\"\",Inmeetformulier!J114)","v":""},{"$f":"IF(Inmeetformulier!K114=\"\",\"\",Inmeetformulier!K114)","v":""},{"$f":"IF(Inmeetformulier!L114=\"\",\"\",Inmeetformulier!L114)","v":""},{"$f":"IF(Inmeetformulier!M114=\"\",\"\",Inmeetformulier!M114)","v":""},{"$f":"IF(Inmeetformulier!N114=\"\",\"\",Inmeetformulier!N114)","v":""},{"$f":"IF(Inmeetformulier!O114=\"\",\"\",Inmeetformulier!O114)","v":""},{"$f":"IF(Inmeetformulier!B114=\"\",\"\",Inmeetformulier!B114)","v":""},{"$f":"IF(Inmeetformulier!S114=\"\",\"\",Inmeetformulier!S114)","v":""}]
[null,{"$f":"IF(Inmeetformulier!P115=\"\",\"\",Inmeetformulier!P115)","v":""},{"$f":"IF(Inmeetformulier!Q115=\"\",\"\",Inmeetformulier!Q115)","v":""},{"$f":"IF(Inmeetformulier!D115=\"\",\"\",Inmeetformulier!D115)","v":""},{"$f":"IF(Inmeetformulier!E115=\"\",\"\",Inmeetformulier!E115)","v":""},{"$f":"IF(Inmeetformulier!F115=\"\",\"\",Inmeetformulier!F115)","v":""},{"$f":"IF(Inmeetformulier!G115=\"\",\"\",Inmeetformulier!G115)","v":""},{"$f":"IF(Inmeetformulier!H115=\"\",\"\",Inmeetformulier!H115)","v":""},{"$f":"IF(Inmeetformulier!I115=\"\",\"\",Inmeetformulier!I115)","v":""},{"$f":"IF(Inmeetformulier!J115=\"\",\"\",Inmeetformulier!J115)","v":""},{"$f":"IF(Inmeetformulier!K115=\"\",\"\",Inmeetformulier!K115)","v":""},{"$f":"IF(Inmeetformulier!L115=\"\",\"\",Inmeetformulier!L115)","v":""},{"$f":"IF(Inmeetformulier!M115=\"\",\"\",Inmeetformulier!M115)","v":""},{"$f":"IF(Inmeetformulier!N115=\"\",\"\",Inmeetformulier!N115)","v":""},{"$f":"IF(Inmeetformulier!O115=\"\",\"\",Inmeetformulier!O115)","v":""},{"$f":"IF(Inmeetformulier!B115=\"\",\"\",Inmeetformulier!B115)","v":""},{"$f":"IF(Inmeetformulier!S115=\"\",\"\",Inmeetformulier!S115)","v":""}]
[null,{"$f":"IF(Inmeetformulier!P116=\"\",\"\",Inmeetformulier!P116)","v":""},{"$f":"IF(Inmeetformulier!Q116=\"\",\"\",Inmeetformulier!Q116)","v":""},{"$f":"IF(Inmeetformulier!D116=\"\",\"\",Inmeetformulier!D116)","v":""},{"$f":"IF(Inmeetformulier!E116=\"\",\"\",Inmeetformulier!E116)","v":""},{"$f":"IF(Inmeetformulier!F116=\"\",\"\",Inmeetformulier!F116)","v":""},{"$f":"IF(Inmeetformulier!G116=\"\",\"\",Inmeetformulier!G116)","v":""},{"$f":"IF(Inmeetformulier!H116=\"\",\"\",Inmeetformulier!H116)","v":""},{"$f":"IF(Inmeetformulier!I116=\"\",\"\",Inmeetformulier!I116)","v":""},{"$f":"IF(Inmeetformulier!J116=\"\",\"\",Inmeetformulier!J116)","v":""},{"$f":"IF(Inmeetformulier!K116=\"\",\"\",Inmeetformulier!K116)","v":""},{"$f":"IF(Inmeetformulier!L116=\"\",\"\",Inmeetformulier!L116)","v":""},{"$f":"IF(Inmeetformulier!M116=\"\",\"\",Inmeetformulier!M116)","v":""},{"$f":"IF(Inmeetformulier!N116=\"\",\"\",Inmeetformulier!N116)","v":""},{"$f":"IF(Inmeetformulier!O116=\"\",\"\",Inmeetformulier!O116)","v":""},{"$f":"IF(Inmeetformulier!B116=\"\",\"\",Inmeetformulier!B116)","v":""},{"$f":"IF(Inmeetformulier!S116=\"\",\"\",Inmeetformulier!S116)","v":""}]
[null,{"$f":"IF(Inmeetformulier!P117=\"\",\"\",Inmeetformulier!P117)","v":""},{"$f":"IF(Inmeetformulier!Q117=\"\",\"\",Inmeetformulier!Q117)","v":""},{"$f":"IF(Inmeetformulier!D117=\"\",\"\",Inmeetformulier!D117)","v":""},{"$f":"IF(Inmeetformulier!E117=\"\",\"\",Inmeetformulier!E117)","v":""},{"$f":"IF(Inmeetformulier!F117=\"\",\"\",Inmeetformulier!F117)","v":""},{"$f":"IF(Inmeetformulier!G117=\"\",\"\",Inmeetformulier!G117)","v":""},{"$f":"IF(Inmeetformulier!H117=\"\",\"\",Inmeetformulier!H117)","v":""},{"$f":"IF(Inmeetformulier!I117=\"\",\"\",Inmeetformulier!I117)","v":""},{"$f":"IF(Inmeetformulier!J117=\"\",\"\",Inmeetformulier!J117)","v":""},{"$f":"IF(Inmeetformulier!K117=\"\",\"\",Inmeetformulier!K117)","v":""},{"$f":"IF(Inmeetformulier!L117=\"\",\"\",Inmeetformulier!L117)","v":""},{"$f":"IF(Inmeetformulier!M117=\"\",\"\",Inmeetformulier!M117)","v":""},{"$f":"IF(Inmeetformulier!N117=\"\",\"\",Inmeetformulier!N117)","v":""},{"$f":"IF(Inmeetformulier!O117=\"\",\"\",Inmeetformulier!O117)","v":""},{"$f":"IF(Inmeetformulier!B117=\"\",\"\",Inmeetformulier!B117)","v":""},{"$f":"IF(Inmeetformulier!S117=\"\",\"\",Inmeetformulier!S117)","v":""}]
[null,{"$f":"IF(Inmeetformulier!P118=\"\",\"\",Inmeetformulier!P118)","v":""},{"$f":"IF(Inmeetformulier!Q118=\"\",\"\",Inmeetformulier!Q118)","v":""},{"$f":"IF(Inmeetformulier!D118=\"\",\"\",Inmeetformulier!D118)","v":""},{"$f":"IF(Inmeetformulier!E118=\"\",\"\",Inmeetformulier!E118)","v":""},{"$f":"IF(Inmeetformulier!F118=\"\",\"\",Inmeetformulier!F118)","v":""},{"$f":"IF(Inmeetformulier!G118=\"\",\"\",Inmeetformulier!G118)","v":""},{"$f":"IF(Inmeetformulier!H118=\"\",\"\",Inmeetformulier!H118)","v":""},{"$f":"IF(Inmeetformulier!I118=\"\",\"\",Inmeetformulier!I118)","v":""},{"$f":"IF(Inmeetformulier!J118=\"\",\"\",Inmeetformulier!J118)","v":""},{"$f":"IF(Inmeetformulier!K118=\"\",\"\",Inmeetformulier!K118)","v":""},{"$f":"IF(Inmeetformulier!L118=\"\",\"\",Inmeetformulier!L118)","v":""},{"$f":"IF(Inmeetformulier!M118=\"\",\"\",Inmeetformulier!M118)","v":""},{"$f":"IF(Inmeetformulier!N118=\"\",\"\",Inmeetformulier!N118)","v":""},{"$f":"IF(Inmeetformulier!O118=\"\",\"\",Inmeetformulier!O118)","v":""},{"$f":"IF(Inmeetformulier!B118=\"\",\"\",Inmeetformulier!B118)","v":""},{"$f":"IF(Inmeetformulier!S118=\"\",\"\",Inmeetformulier!S118)","v":""}]
[null,{"$f":"IF(Inmeetformulier!P119=\"\",\"\",Inmeetformulier!P119)","v":""},{"$f":"IF(Inmeetformulier!Q119=\"\",\"\",Inmeetformulier!Q119)","v":""},{"$f":"IF(Inmeetformulier!D119=\"\",\"\",Inmeetformulier!D119)","v":""},{"$f":"IF(Inmeetformulier!E119=\"\",\"\",Inmeetformulier!E119)","v":""},{"$f":"IF(Inmeetformulier!F119=\"\",\"\",Inmeetformulier!F119)","v":""},{"$f":"IF(Inmeetformulier!G119=\"\",\"\",Inmeetformulier!G119)","v":""},{"$f":"IF(Inmeetformulier!H119=\"\",\"\",Inmeetformulier!H119)","v":""},{"$f":"IF(Inmeetformulier!I119=\"\",\"\",Inmeetformulier!I119)","v":""},{"$f":"IF(Inmeetformulier!J119=\"\",\"\",Inmeetformulier!J119)","v":""},{"$f":"IF(Inmeetformulier!K119=\"\",\"\",Inmeetformulier!K119)","v":""},{"$f":"IF(Inmeetformulier!L119=\"\",\"\",Inmeetformulier!L119)","v":""},{"$f":"IF(Inmeetformulier!M119=\"\",\"\",Inmeetformulier!M119)","v":""},{"$f":"IF(Inmeetformulier!N119=\"\",\"\",Inmeetformulier!N119)","v":""},{"$f":"IF(Inmeetformulier!O119=\"\",\"\",Inmeetformulier!O119)","v":""},{"$f":"IF(Inmeetformulier!B119=\"\",\"\",Inmeetformulier!B119)","v":""},{"$f":"IF(Inmeetformulier!S119=\"\",\"\",Inmeetformulier!S119)","v":""}]
[null,{"$f":"IF(Inmeetformulier!P120=\"\",\"\",Inmeetformulier!P120)","v":""},{"$f":"IF(Inmeetformulier!Q120=\"\",\"\",Inmeetformulier!Q120)","v":""},{"$f":"IF(Inmeetformulier!D120=\"\",\"\",Inmeetformulier!D120)","v":""},{"$f":"IF(Inmeetformulier!E120=\"\",\"\",Inmeetformulier!E120)","v":""},{"$f":"IF(Inmeetformulier!F120=\"\",\"\",Inmeetformulier!F120)","v":""},{"$f":"IF(Inmeetformulier!G120=\"\",\"\",Inmeetformulier!G120)","v":""},{"$f":"IF(Inmeetformulier!H120=\"\",\"\",Inmeetformulier!H120)","v":""},{"$f":"IF(Inmeetformulier!I120=\"\",\"\",Inmeetformulier!I120)","v":""},{"$f":"IF(Inmeetformulier!J120=\"\",\"\",Inmeetformulier!J120)","v":""},{"$f":"IF(Inmeetformulier!K120=\"\",\"\",Inmeetformulier!K120)","v":""},{"$f":"IF(Inmeetformulier!L120=\"\",\"\",Inmeetformulier!L120)","v":""},{"$f":"IF(Inmeetformulier!M120=\"\",\"\",Inmeetformulier!M120)","v":""},{"$f":"IF(Inmeetformulier!N120=\"\",\"\",Inmeetformulier!N120)","v":""},{"$f":"IF(Inmeetformulier!O120=\"\",\"\",Inmeetformulier!O120)","v":""},{"$f":"IF(Inmeetformulier!B120=\"\",\"\",Inmeetformulier!B120)","v":""},{"$f":"IF(Inmeetformulier!S120=\"\",\"\",Inmeetformulier!S120)","v":""}]
[null,{"$f":"IF(Inmeetformulier!P121=\"\",\"\",Inmeetformulier!P121)","v":""},{"$f":"IF(Inmeetformulier!Q121=\"\",\"\",Inmeetformulier!Q121)","v":""},{"$f":"IF(Inmeetformulier!D121=\"\",\"\",Inmeetformulier!D121)","v":""},{"$f":"IF(Inmeetformulier!E121=\"\",\"\",Inmeetformulier!E121)","v":""},{"$f":"IF(Inmeetformulier!F121=\"\",\"\",Inmeetformulier!F121)","v":""},{"$f":"IF(Inmeetformulier!G121=\"\",\"\",Inmeetformulier!G121)","v":""},{"$f":"IF(Inmeetformulier!H121=\"\",\"\",Inmeetformulier!H121)","v":""},{"$f":"IF(Inmeetformulier!I121=\"\",\"\",Inmeetformulier!I121)","v":""},{"$f":"IF(Inmeetformulier!J121=\"\",\"\",Inmeetformulier!J121)","v":""},{"$f":"IF(Inmeetformulier!K121=\"\",\"\",Inmeetformulier!K121)","v":""},{"$f":"IF(Inmeetformulier!L121=\"\",\"\",Inmeetformulier!L121)","v":""},{"$f":"IF(Inmeetformulier!M121=\"\",\"\",Inmeetformulier!M121)","v":""},{"$f":"IF(Inmeetformulier!N121=\"\",\"\",Inmeetformulier!N121)","v":""},{"$f":"IF(Inmeetformulier!O121=\"\",\"\",Inmeetformulier!O121)","v":""},{"$f":"IF(Inmeetformulier!B121=\"\",\"\",Inmeetformulier!B121)","v":""},{"$f":"IF(Inmeetformulier!S121=\"\",\"\",Inmeetformulier!S121)","v":""}]
[null,{"$f":"IF(Inmeetformulier!P122=\"\",\"\",Inmeetformulier!P122)","v":""},{"$f":"IF(Inmeetformulier!Q122=\"\",\"\",Inmeetformulier!Q122)","v":""},{"$f":"IF(Inmeetformulier!D122=\"\",\"\",Inmeetformulier!D122)","v":""},{"$f":"IF(Inmeetformulier!E122=\"\",\"\",Inmeetformulier!E122)","v":""},{"$f":"IF(Inmeetformulier!F122=\"\",\"\",Inmeetformulier!F122)","v":""},{"$f":"IF(Inmeetformulier!G122=\"\",\"\",Inmeetformulier!G122)","v":""},{"$f":"IF(Inmeetformulier!H122=\"\",\"\",Inmeetformulier!H122)","v":""},{"$f":"IF(Inmeetformulier!I122=\"\",\"\",Inmeetformulier!I122)","v":""},{"$f":"IF(Inmeetformulier!J122=\"\",\"\",Inmeetformulier!J122)","v":""},{"$f":"IF(Inmeetformulier!K122=\"\",\"\",Inmeetformulier!K122)","v":""},{"$f":"IF(Inmeetformulier!L122=\"\",\"\",Inmeetformulier!L122)","v":""},{"$f":"IF(Inmeetformulier!M122=\"\",\"\",Inmeetformulier!M122)","v":""},{"$f":"IF(Inmeetformulier!N122=\"\",\"\",Inmeetformulier!N122)","v":""},{"$f":"IF(Inmeetformulier!O122=\"\",\"\",Inmeetformulier!O122)","v":""},{"$f":"IF(Inmeetformulier!B122=\"\",\"\",Inmeetformulier!B122)","v":""},{"$f":"IF(Inmeetformulier!S122=\"\",\"\",Inmeetformulier!S122)","v":""}]
[null,{"$f":"IF(Inmeetformulier!P123=\"\",\"\",Inmeetformulier!P123)","v":""},{"$f":"IF(Inmeetformulier!Q123=\"\",\"\",Inmeetformulier!Q123)","v":""},{"$f":"IF(Inmeetformulier!D123=\"\",\"\",Inmeetformulier!D123)","v":""},{"$f":"IF(Inmeetformulier!E123=\"\",\"\",Inmeetformulier!E123)","v":""},{"$f":"IF(Inmeetformulier!F123=\"\",\"\",Inmeetformulier!F123)","v":""},{"$f":"IF(Inmeetformulier!G123=\"\",\"\",Inmeetformulier!G123)","v":""},{"$f":"IF(Inmeetformulier!H123=\"\",\"\",Inmeetformulier!H123)","v":""},{"$f":"IF(Inmeetformulier!I123=\"\",\"\",Inmeetformulier!I123)","v":""},{"$f":"IF(Inmeetformulier!J123=\"\",\"\",Inmeetformulier!J123)","v":""},{"$f":"IF(Inmeetformulier!K123=\"\",\"\",Inmeetformulier!K123)","v":""},{"$f":"IF(Inmeetformulier!L123=\"\",\"\",Inmeetformulier!L123)","v":""},{"$f":"IF(Inmeetformulier!M123=\"\",\"\",Inmeetformulier!M123)","v":""},{"$f":"IF(Inmeetformulier!N123=\"\",\"\",Inmeetformulier!N123)","v":""},{"$f":"IF(Inmeetformulier!O123=\"\",\"\",Inmeetformulier!O123)","v":""},{"$f":"IF(Inmeetformulier!B123=\"\",\"\",Inmeetformulier!B123)","v":""},{"$f":"IF(Inmeetformulier!S123=\"\",\"\",Inmeetformulier!S123)","v":""}]
[null,{"$f":"IF(Inmeetformulier!P124=\"\",\"\",Inmeetformulier!P124)","v":""},{"$f":"IF(Inmeetformulier!Q124=\"\",\"\",Inmeetformulier!Q124)","v":""},{"$f":"IF(Inmeetformulier!D124=\"\",\"\",Inmeetformulier!D124)","v":""},{"$f":"IF(Inmeetformulier!E124=\"\",\"\",Inmeetformulier!E124)","v":""},{"$f":"IF(Inmeetformulier!F124=\"\",\"\",Inmeetformulier!F124)","v":""},{"$f":"IF(Inmeetformulier!G124=\"\",\"\",Inmeetformulier!G124)","v":""},{"$f":"IF(Inmeetformulier!H124=\"\",\"\",Inmeetformulier!H124)","v":""},{"$f":"IF(Inmeetformulier!I124=\"\",\"\",Inmeetformulier!I124)","v":""},{"$f":"IF(Inmeetformulier!J124=\"\",\"\",Inmeetformulier!J124)","v":""},{"$f":"IF(Inmeetformulier!K124=\"\",\"\",Inmeetformulier!K124)","v":""},{"$f":"IF(Inmeetformulier!L124=\"\",\"\",Inmeetformulier!L124)","v":""},{"$f":"IF(Inmeetformulier!M124=\"\",\"\",Inmeetformulier!M124)","v":""},{"$f":"IF(Inmeetformulier!N124=\"\",\"\",Inmeetformulier!N124)","v":""},{"$f":"IF(Inmeetformulier!O124=\"\",\"\",Inmeetformulier!O124)","v":""},{"$f":"IF(Inmeetformulier!B124=\"\",\"\",Inmeetformulier!B124)","v":""},{"$f":"IF(Inmeetformulier!S124=\"\",\"\",Inmeetformulier!S124)","v":""}]
[null,{"$f":"IF(Inmeetformulier!P125=\"\",\"\",Inmeetformulier!P125)","v":""},{"$f":"IF(Inmeetformulier!Q125=\"\",\"\",Inmeetformulier!Q125)","v":""},{"$f":"IF(Inmeetformulier!D125=\"\",\"\",Inmeetformulier!D125)","v":""},{"$f":"IF(Inmeetformulier!E125=\"\",\"\",Inmeetformulier!E125)","v":""},{"$f":"IF(Inmeetformulier!F125=\"\",\"\",Inmeetformulier!F125)","v":""},{"$f":"IF(Inmeetformulier!G125=\"\",\"\",Inmeetformulier!G125)","v":""},{"$f":"IF(Inmeetformulier!H125=\"\",\"\",Inmeetformulier!H125)","v":""},{"$f":"IF(Inmeetformulier!I125=\"\",\"\",Inmeetformulier!I125)","v":""},{"$f":"IF(Inmeetformulier!J125=\"\",\"\",Inmeetformulier!J125)","v":""},{"$f":"IF(Inmeetformulier!K125=\"\",\"\",Inmeetformulier!K125)","v":""},{"$f":"IF(Inmeetformulier!L125=\"\",\"\",Inmeetformulier!L125)","v":""},{"$f":"IF(Inmeetformulier!M125=\"\",\"\",Inmeetformulier!M125)","v":""},{"$f":"IF(Inmeetformulier!N125=\"\",\"\",Inmeetformulier!N125)","v":""},{"$f":"IF(Inmeetformulier!O125=\"\",\"\",Inmeetformulier!O125)","v":""},{"$f":"IF(Inmeetformulier!B125=\"\",\"\",Inmeetformulier!B125)","v":""},{"$f":"IF(Inmeetformulier!S125=\"\",\"\",Inmeetformulier!S125)","v":""}]

{"sheet":"Factuurregels","index":10,"n_rows":204,"n_cols":13,"rows_kept":204,"cut":false,"hidden":true,"merged":[]}
["Vertrek","Omschrijving",null,"Toelichting (evt.)",null,{"$f":"'Offerte goederen'!R24","v":"Prijs       (excl. BTW)"},"per",null,"Aantal\neenh.",null,"Bedrag\n(excl. BTW)",null,"Bedrag\n(incl. BTW)"]
[{"$f":"'Offerte goederen'!B25","v":0},{"$f":"CONCATENATE(IF('Offerte goederen'!C25=0,\"\",CONCATENATE('Offerte goederen'!C25,\", \")),IF('Offerte goederen'!O25=0,\"\",CONCATENATE(\"merk: \",'Offerte goederen'!O25)),IF('Offerte goederen'!N25=0,\"\",CONCATENATE(\", omschrijving: \",'Offerte goederen'!N25)),IF('Offerte goederen'!H25=0,\"\",CONCATENATE(\", plooi: \",'Offerte goederen'!H25)),IF('Offerte goederen'!J25=0,\"\",CONCATENATE(\", railtype: \",'Offerte goederen'!J25)),IF('Offerte goederen'!K25=0,\"\",CONCATENATE(\", railkleur: \",'Offerte goederen'!K25)))","v":""},"G",{"$f":"'Offerte goederen'!P25","v":0},null,{"$f":"IF(C2=\"G\",'Offerte goederen'!R25,IF(C2=\"M\",'Offerte montage'!L25,\"\"))","v":0},{"$f":"IF(C2=\"G\",'Offerte goederen'!S25,IF(C2=\"M\",'Offerte montage'!M25,\"\"))","v":0},null,{"$f":"IF(C2=\"G\",'Offerte goederen'!U25,IF(C2=\"M\",'Offerte montage'!O25,\"\"))","v":0},null,{"$f":"IF(C2=\"G\",'Offerte goederen'!W25,IF(C2=\"M\",'Offerte montage'!Q25,\"\"))","v":""},null,{"$f":"IF(C2=\"G\",'Offerte goederen'!Y25,IF(C2=\"M\",'Offerte montage'!S25,\"\"))","v":""}]
[{"$f":"'Offerte goederen'!B26","v":0},{"$f":"CONCATENATE(IF('Offerte goederen'!C26=0,\"\",CONCATENATE('Offerte goederen'!C26,\", \")),IF('Offerte goederen'!O26=0,\"\",CONCATENATE(\"merk: \",'Offerte goederen'!O26)),IF('Offerte goederen'!N26=0,\"\",CONCATENATE(\", omschrijving: \",'Offerte goederen'!N26)),IF('Offerte goederen'!H26=0,\"\",CONCATENATE(\", plooi: \",'Offerte goederen'!H26)),IF('Offerte goederen'!J26=0,\"\",CONCATENATE(\", railtype: \",'Offerte goederen'!J26)),IF('Offerte goederen'!K26=0,\"\",CONCATENATE(\", railkleur: \",'Offerte goederen'!K26)))","v":""},"G",{"$f":"'Offerte goederen'!P26","v":0},null,{"$f":"IF(C3=\"G\",'Offerte goederen'!R26,IF(C3=\"M\",'Offerte montage'!L26,\"\"))","v":0},{"$f":"IF(C3=\"G\",'Offerte goederen'!S26,IF(C3=\"M\",'Offerte montage'!M26,\"\"))","v":0},null,{"$f":"IF(C3=\"G\",'Offerte goederen'!U26,IF(C3=\"M\",'Offerte montage'!O26,\"\"))","v":0},null,{"$f":"IF(C3=\"G\",'Offerte goederen'!W26,IF(C3=\"M\",'Offerte montage'!Q26,\"\"))","v":""},null,{"$f":"IF(C3=\"G\",'Offerte goederen'!Y26,IF(C3=\"M\",'Offerte montage'!S26,\"\"))","v":""}]
[{"$f":"'Offerte goederen'!B27","v":0},{"$f":"CONCATENATE(IF('Offerte goederen'!C27=0,\"\",CONCATENATE('Offerte goederen'!C27,\", \")),IF('Offerte goederen'!O27=0,\"\",CONCATENATE(\"merk: \",'Offerte goederen'!O27)),IF('Offerte goederen'!N27=0,\"\",CONCATENATE(\", omschrijving: \",'Offerte goederen'!N27)),IF('Offerte goederen'!H27=0,\"\",CONCATENATE(\", plooi: \",'Offerte goederen'!H27)),IF('Offerte goederen'!J27=0,\"\",CONCATENATE(\", railtype: \",'Offerte goederen'!J27)),IF('Offerte goederen'!K27=0,\"\",CONCATENATE(\", railkleur: \",'Offerte goederen'!K27)))","v":""},"G",{"$f":"'Offerte goederen'!P27","v":0},null,{"$f":"IF(C4=\"G\",'Offerte goederen'!R27,IF(C4=\"M\",'Offerte montage'!L27,\"\"))","v":0},{"$f":"IF(C4=\"G\",'Offerte goederen'!S27,IF(C4=\"M\",'Offerte montage'!M27,\"\"))","v":0},null,{"$f":"IF(C4=\"G\",'Offerte goederen'!U27,IF(C4=\"M\",'Offerte montage'!O27,\"\"))","v":0},null,{"$f":"IF(C4=\"G\",'Offerte goederen'!W27,IF(C4=\"M\",'Offerte montage'!Q27,\"\"))","v":""},null,{"$f":"IF(C4=\"G\",'Offerte goederen'!Y27,IF(C4=\"M\",'Offerte montage'!S27,\"\"))","v":""}]
[{"$f":"'Offerte goederen'!B28","v":0},{"$f":"CONCATENATE(IF('Offerte goederen'!C28=0,\"\",CONCATENATE('Offerte goederen'!C28,\", \")),IF('Offerte goederen'!O28=0,\"\",CONCATENATE(\"merk: \",'Offerte goederen'!O28)),IF('Offerte goederen'!N28=0,\"\",CONCATENATE(\", omschrijving: \",'Offerte goederen'!N28)),IF('Offerte goederen'!H28=0,\"\",CONCATENATE(\", plooi: \",'Offerte goederen'!H28)),IF('Offerte goederen'!J28=0,\"\",CONCATENATE(\", railtype: \",'Offerte goederen'!J28)),IF('Offerte goederen'!K28=0,\"\",CONCATENATE(\", railkleur: \",'Offerte goederen'!K28)))","v":""},"G",{"$f":"'Offerte goederen'!P28","v":0},null,{"$f":"IF(C5=\"G\",'Offerte goederen'!R28,IF(C5=\"M\",'Offerte montage'!L28,\"\"))","v":0},{"$f":"IF(C5=\"G\",'Offerte goederen'!S28,IF(C5=\"M\",'Offerte montage'!M28,\"\"))","v":0},null,{"$f":"IF(C5=\"G\",'Offerte goederen'!U28,IF(C5=\"M\",'Offerte montage'!O28,\"\"))","v":0},null,{"$f":"IF(C5=\"G\",'Offerte goederen'!W28,IF(C5=\"M\",'Offerte montage'!Q28,\"\"))","v":""},null,{"$f":"IF(C5=\"G\",'Offerte goederen'!Y28,IF(C5=\"M\",'Offerte montage'!S28,\"\"))","v":""}]
[{"$f":"'Offerte goederen'!B29","v":0},{"$f":"CONCATENATE(IF('Offerte goederen'!C29=0,\"\",CONCATENATE('Offerte goederen'!C29,\", \")),IF('Offerte goederen'!O29=0,\"\",CONCATENATE(\"merk: \",'Offerte goederen'!O29)),IF('Offerte goederen'!N29=0,\"\",CONCATENATE(\", omschrijving: \",'Offerte goederen'!N29)),IF('Offerte goederen'!H29=0,\"\",CONCATENATE(\", plooi: \",'Offerte goederen'!H29)),IF('Offerte goederen'!J29=0,\"\",CONCATENATE(\", railtype: \",'Offerte goederen'!J29)),IF('Offerte goederen'!K29=0,\"\",CONCATENATE(\", railkleur: \",'Offerte goederen'!K29)))","v":""},"G",{"$f":"'Offerte goederen'!P29","v":0},null,{"$f":"IF(C6=\"G\",'Offerte goederen'!R29,IF(C6=\"M\",'Offerte montage'!L29,\"\"))","v":0},{"$f":"IF(C6=\"G\",'Offerte goederen'!S29,IF(C6=\"M\",'Offerte montage'!M29,\"\"))","v":0},null,{"$f":"IF(C6=\"G\",'Offerte goederen'!U29,IF(C6=\"M\",'Offerte montage'!O29,\"\"))","v":0},null,{"$f":"IF(C6=\"G\",'Offerte goederen'!W29,IF(C6=\"M\",'Offerte montage'!Q29,\"\"))","v":""},null,{"$f":"IF(C6=\"G\",'Offerte goederen'!Y29,IF(C6=\"M\",'Offerte montage'!S29,\"\"))","v":""}]
[{"$f":"'Offerte goederen'!B30","v":0},{"$f":"CONCATENATE(IF('Offerte goederen'!C30=0,\"\",CONCATENATE('Offerte goederen'!C30,\", \")),IF('Offerte goederen'!O30=0,\"\",CONCATENATE(\"merk: \",'Offerte goederen'!O30)),IF('Offerte goederen'!N30=0,\"\",CONCATENATE(\", omschrijving: \",'Offerte goederen'!N30)),IF('Offerte goederen'!H30=0,\"\",CONCATENATE(\", plooi: \",'Offerte goederen'!H30)),IF('Offerte goederen'!J30=0,\"\",CONCATENATE(\", railtype: \",'Offerte goederen'!J30)),IF('Offerte goederen'!K30=0,\"\",CONCATENATE(\", railkleur: \",'Offerte goederen'!K30)))","v":""},"G",{"$f":"'Offerte goederen'!P30","v":0},null,{"$f":"IF(C7=\"G\",'Offerte goederen'!R30,IF(C7=\"M\",'Offerte montage'!L30,\"\"))","v":0},{"$f":"IF(C7=\"G\",'Offerte goederen'!S30,IF(C7=\"M\",'Offerte montage'!M30,\"\"))","v":0},null,{"$f":"IF(C7=\"G\",'Offerte goederen'!U30,IF(C7=\"M\",'Offerte montage'!O30,\"\"))","v":0},null,{"$f":"IF(C7=\"G\",'Offerte goederen'!W30,IF(C7=\"M\",'Offerte montage'!Q30,\"\"))","v":""},null,{"$f":"IF(C7=\"G\",'Offerte goederen'!Y30,IF(C7=\"M\",'Offerte montage'!S30,\"\"))","v":""}]
[{"$f":"'Offerte goederen'!B31","v":0},{"$f":"CONCATENATE(IF('Offerte goederen'!C31=0,\"\",CONCATENATE('Offerte goederen'!C31,\", \")),IF('Offerte goederen'!O31=0,\"\",CONCATENATE(\"merk: \",'Offerte goederen'!O31)),IF('Offerte goederen'!N31=0,\"\",CONCATENATE(\", omschrijving: \",'Offerte goederen'!N31)),IF('Offerte goederen'!H31=0,\"\",CONCATENATE(\", plooi: \",'Offerte goederen'!H31)),IF('Offerte goederen'!J31=0,\"\",CONCATENATE(\", railtype: \",'Offerte goederen'!J31)),IF('Offerte goederen'!K31=0,\"\",CONCATENATE(\", railkleur: \",'Offerte goederen'!K31)))","v":""},"G",{"$f":"'Offerte goederen'!P31","v":0},null,{"$f":"IF(C8=\"G\",'Offerte goederen'!R31,IF(C8=\"M\",'Offerte montage'!L31,\"\"))","v":0},{"$f":"IF(C8=\"G\",'Offerte goederen'!S31,IF(C8=\"M\",'Offerte montage'!M31,\"\"))","v":0},null,{"$f":"IF(C8=\"G\",'Offerte goederen'!U31,IF(C8=\"M\",'Offerte montage'!O31,\"\"))","v":0},null,{"$f":"IF(C8=\"G\",'Offerte goederen'!W31,IF(C8=\"M\",'Offerte montage'!Q31,\"\"))","v":""},null,{"$f":"IF(C8=\"G\",'Offerte goederen'!Y31,IF(C8=\"M\",'Offerte montage'!S31,\"\"))","v":""}]
[{"$f":"'Offerte goederen'!B32","v":0},{"$f":"CONCATENATE(IF('Offerte goederen'!C32=0,\"\",CONCATENATE('Offerte goederen'!C32,\", \")),IF('Offerte goederen'!O32=0,\"\",CONCATENATE(\"merk: \",'Offerte goederen'!O32)),IF('Offerte goederen'!N32=0,\"\",CONCATENATE(\", omschrijving: \",'Offerte goederen'!N32)),IF('Offerte goederen'!H32=0,\"\",CONCATENATE(\", plooi: \",'Offerte goederen'!H32)),IF('Offerte goederen'!J32=0,\"\",CONCATENATE(\", railtype: \",'Offerte goederen'!J32)),IF('Offerte goederen'!K32=0,\"\",CONCATENATE(\", railkleur: \",'Offerte goederen'!K32)))","v":""},"G",{"$f":"'Offerte goederen'!P32","v":0},null,{"$f":"IF(C9=\"G\",'Offerte goederen'!R32,IF(C9=\"M\",'Offerte montage'!L32,\"\"))","v":0},{"$f":"IF(C9=\"G\",'Offerte goederen'!S32,IF(C9=\"M\",'Offerte montage'!M32,\"\"))","v":0},null,{"$f":"IF(C9=\"G\",'Offerte goederen'!U32,IF(C9=\"M\",'Offerte montage'!O32,\"\"))","v":0},null,{"$f":"IF(C9=\"G\",'Offerte goederen'!W32,IF(C9=\"M\",'Offerte montage'!Q32,\"\"))","v":""},null,{"$f":"IF(C9=\"G\",'Offerte goederen'!Y32,IF(C9=\"M\",'Offerte montage'!S32,\"\"))","v":""}]
[{"$f":"'Offerte goederen'!B33","v":0},{"$f":"CONCATENATE(IF('Offerte goederen'!C33=0,\"\",CONCATENATE('Offerte goederen'!C33,\", \")),IF('Offerte goederen'!O33=0,\"\",CONCATENATE(\"merk: \",'Offerte goederen'!O33)),IF('Offerte goederen'!N33=0,\"\",CONCATENATE(\", omschrijving: \",'Offerte goederen'!N33)),IF('Offerte goederen'!H33=0,\"\",CONCATENATE(\", plooi: \",'Offerte goederen'!H33)),IF('Offerte goederen'!J33=0,\"\",CONCATENATE(\", railtype: \",'Offerte goederen'!J33)),IF('Offerte goederen'!K33=0,\"\",CONCATENATE(\", railkleur: \",'Offerte goederen'!K33)))","v":""},"G",{"$f":"'Offerte goederen'!P33","v":0},null,{"$f":"IF(C10=\"G\",'Offerte goederen'!R33,IF(C10=\"M\",'Offerte montage'!L33,\"\"))","v":0},{"$f":"IF(C10=\"G\",'Offerte goederen'!S33,IF(C10=\"M\",'Offerte montage'!M33,\"\"))","v":0},null,{"$f":"IF(C10=\"G\",'Offerte goederen'!U33,IF(C10=\"M\",'Offerte montage'!O33,\"\"))","v":0},null,{"$f":"IF(C10=\"G\",'Offerte goederen'!W33,IF(C10=\"M\",'Offerte montage'!Q33,\"\"))","v":""},null,{"$f":"IF(C10=\"G\",'Offerte goederen'!Y33,IF(C10=\"M\",'Offerte montage'!S33,\"\"))","v":""}]
[{"$f":"'Offerte goederen'!B34","v":0},{"$f":"CONCATENATE(IF('Offerte goederen'!C34=0,\"\",CONCATENATE('Offerte goederen'!C34,\", \")),IF('Offerte goederen'!O34=0,\"\",CONCATENATE(\"merk: \",'Offerte goederen'!O34)),IF('Offerte goederen'!N34=0,\"\",CONCATENATE(\", omschrijving: \",'Offerte goederen'!N34)),IF('Offerte goederen'!H34=0,\"\",CONCATENATE(\", plooi: \",'Offerte goederen'!H34)),IF('Offerte goederen'!J34=0,\"\",CONCATENATE(\", railtype: \",'Offerte goederen'!J34)),IF('Offerte goederen'!K34=0,\"\",CONCATENATE(\", railkleur: \",'Offerte goederen'!K34)))","v":""},"G",{"$f":"'Offerte goederen'!P34","v":0},null,{"$f":"IF(C11=\"G\",'Offerte goederen'!R34,IF(C11=\"M\",'Offerte montage'!L34,\"\"))","v":0},{"$f":"IF(C11=\"G\",'Offerte goederen'!S34,IF(C11=\"M\",'Offerte montage'!M34,\"\"))","v":0},null,{"$f":"IF(C11=\"G\",'Offerte goederen'!U34,IF(C11=\"M\",'Offerte montage'!O34,\"\"))","v":0},null,{"$f":"IF(C11=\"G\",'Offerte goederen'!W34,IF(C11=\"M\",'Offerte montage'!Q34,\"\"))","v":""},null,{"$f":"IF(C11=\"G\",'Offerte goederen'!Y34,IF(C11=\"M\",'Offerte montage'!S34,\"\"))","v":""}]
[{"$f":"'Offerte goederen'!B35","v":0},{"$f":"CONCATENATE(IF('Offerte goederen'!C35=0,\"\",CONCATENATE('Offerte goederen'!C35,\", \")),IF('Offerte goederen'!O35=0,\"\",CONCATENATE(\"merk: \",'Offerte goederen'!O35)),IF('Offerte goederen'!N35=0,\"\",CONCATENATE(\", omschrijving: \",'Offerte goederen'!N35)),IF('Offerte goederen'!H35=0,\"\",CONCATENATE(\", plooi: \",'Offerte goederen'!H35)),IF('Offerte goederen'!J35=0,\"\",CONCATENATE(\", railtype: \",'Offerte goederen'!J35)),IF('Offerte goederen'!K35=0,\"\",CONCATENATE(\", railkleur: \",'Offerte goederen'!K35)))","v":""},"G",{"$f":"'Offerte goederen'!P35","v":0},null,{"$f":"IF(C12=\"G\",'Offerte goederen'!R35,IF(C12=\"M\",'Offerte montage'!L35,\"\"))","v":0},{"$f":"IF(C12=\"G\",'Offerte goederen'!S35,IF(C12=\"M\",'Offerte montage'!M35,\"\"))","v":0},null,{"$f":"IF(C12=\"G\",'Offerte goederen'!U35,IF(C12=\"M\",'Offerte montage'!O35,\"\"))","v":0},null,{"$f":"IF(C12=\"G\",'Offerte goederen'!W35,IF(C12=\"M\",'Offerte montage'!Q35,\"\"))","v":""},null,{"$f":"IF(C12=\"G\",'Offerte goederen'!Y35,IF(C12=\"M\",'Offerte montage'!S35,\"\"))","v":""}]
[{"$f":"'Offerte goederen'!B36","v":0},{"$f":"CONCATENATE(IF('Offerte goederen'!C36=0,\"\",CONCATENATE('Offerte goederen'!C36,\", \")),IF('Offerte goederen'!O36=0,\"\",CONCATENATE(\"merk: \",'Offerte goederen'!O36)),IF('Offerte goederen'!N36=0,\"\",CONCATENATE(\", omschrijving: \",'Offerte goederen'!N36)),IF('Offerte goederen'!H36=0,\"\",CONCATENATE(\", plooi: \",'Offerte goederen'!H36)),IF('Offerte goederen'!J36=0,\"\",CONCATENATE(\", railtype: \",'Offerte goederen'!J36)),IF('Offerte goederen'!K36=0,\"\",CONCATENATE(\", railkleur: \",'Offerte goederen'!K36)))","v":""},"G",{"$f":"'Offerte goederen'!P36","v":0},null,{"$f":"IF(C13=\"G\",'Offerte goederen'!R36,IF(C13=\"M\",'Offerte montage'!L36,\"\"))","v":0},{"$f":"IF(C13=\"G\",'Offerte goederen'!S36,IF(C13=\"M\",'Offerte montage'!M36,\"\"))","v":0},null,{"$f":"IF(C13=\"G\",'Offerte goederen'!U36,IF(C13=\"M\",'Offerte montage'!O36,\"\"))","v":0},null,{"$f":"IF(C13=\"G\",'Offerte goederen'!W36,IF(C13=\"M\",'Offerte montage'!Q36,\"\"))","v":""},null,{"$f":"IF(C13=\"G\",'Offerte goederen'!Y36,IF(C13=\"M\",'Offerte montage'!S36,\"\"))","v":""}]
[{"$f":"'Offerte goederen'!B37","v":0},{"$f":"CONCATENATE(IF('Offerte goederen'!C37=0,\"\",CONCATENATE('Offerte goederen'!C37,\", \")),IF('Offerte goederen'!O37=0,\"\",CONCATENATE(\"merk: \",'Offerte goederen'!O37)),IF('Offerte goederen'!N37=0,\"\",CONCATENATE(\", omschrijving: \",'Offerte goederen'!N37)),IF('Offerte goederen'!H37=0,\"\",CONCATENATE(\", plooi: \",'Offerte goederen'!H37)),IF('Offerte goederen'!J37=0,\"\",CONCATENATE(\", railtype: \",'Offerte goederen'!J37)),IF('Offerte goederen'!K37=0,\"\",CONCATENATE(\", railkleur: \",'Offerte goederen'!K37)))","v":""},"G",{"$f":"'Offerte goederen'!P37","v":0},null,{"$f":"IF(C14=\"G\",'Offerte goederen'!R37,IF(C14=\"M\",'Offerte montage'!L37,\"\"))","v":0},{"$f":"IF(C14=\"G\",'Offerte goederen'!S37,IF(C14=\"M\",'Offerte montage'!M37,\"\"))","v":0},null,{"$f":"IF(C14=\"G\",'Offerte goederen'!U37,IF(C14=\"M\",'Offerte montage'!O37,\"\"))","v":0},null,{"$f":"IF(C14=\"G\",'Offerte goederen'!W37,IF(C14=\"M\",'Offerte montage'!Q37,\"\"))","v":""},null,{"$f":"IF(C14=\"G\",'Offerte goederen'!Y37,IF(C14=\"M\",'Offerte montage'!S37,\"\"))","v":""}]
[{"$f":"'Offerte goederen'!B38","v":0},{"$f":"CONCATENATE(IF('Offerte goederen'!C38=0,\"\",CONCATENATE('Offerte goederen'!C38,\", \")),IF('Offerte goederen'!O38=0,\"\",CONCATENATE(\"merk: \",'Offerte goederen'!O38)),IF('Offerte goederen'!N38=0,\"\",CONCATENATE(\", omschrijving: \",'Offerte goederen'!N38)),IF('Offerte goederen'!H38=0,\"\",CONCATENATE(\", plooi: \",'Offerte goederen'!H38)),IF('Offerte goederen'!J38=0,\"\",CONCATENATE(\", railtype: \",'Offerte goederen'!J38)),IF('Offerte goederen'!K38=0,\"\",CONCATENATE(\", railkleur: \",'Offerte goederen'!K38)))","v":""},"G",{"$f":"'Offerte goederen'!P38","v":0},null,{"$f":"IF(C15=\"G\",'Offerte goederen'!R38,IF(C15=\"M\",'Offerte montage'!L38,\"\"))","v":0},{"$f":"IF(C15=\"G\",'Offerte goederen'!S38,IF(C15=\"M\",'Offerte montage'!M38,\"\"))","v":0},null,{"$f":"IF(C15=\"G\",'Offerte goederen'!U38,IF(C15=\"M\",'Offerte montage'!O38,\"\"))","v":0},null,{"$f":"IF(C15=\"G\",'Offerte goederen'!W38,IF(C15=\"M\",'Offerte montage'!Q38,\"\"))","v":""},null,{"$f":"IF(C15=\"G\",'Offerte goederen'!Y38,IF(C15=\"M\",'Offerte montage'!S38,\"\"))","v":""}]
[{"$f":"'Offerte goederen'!B39","v":0},{"$f":"CONCATENATE(IF('Offerte goederen'!C39=0,\"\",CONCATENATE('Offerte goederen'!C39,\", \")),IF('Offerte goederen'!O39=0,\"\",CONCATENATE(\"merk: \",'Offerte goederen'!O39)),IF('Offerte goederen'!N39=0,\"\",CONCATENATE(\", omschrijving: \",'Offerte goederen'!N39)),IF('Offerte goederen'!H39=0,\"\",CONCATENATE(\", plooi: \",'Offerte goederen'!H39)),IF('Offerte goederen'!J39=0,\"\",CONCATENATE(\", railtype: \",'Offerte goederen'!J39)),IF('Offerte goederen'!K39=0,\"\",CONCATENATE(\", railkleur: \",'Offerte goederen'!K39)))","v":""},"G",{"$f":"'Offerte goederen'!P39","v":0},null,{"$f":"IF(C16=\"G\",'Offerte goederen'!R39,IF(C16=\"M\",'Offerte montage'!L39,\"\"))","v":0},{"$f":"IF(C16=\"G\",'Offerte goederen'!S39,IF(C16=\"M\",'Offerte montage'!M39,\"\"))","v":0},null,{"$f":"IF(C16=\"G\",'Offerte goederen'!U39,IF(C16=\"M\",'Offerte montage'!O39,\"\"))","v":0},null,{"$f":"IF(C16=\"G\",'Offerte goederen'!W39,IF(C16=\"M\",'Offerte montage'!Q39,\"\"))","v":""},null,{"$f":"IF(C16=\"G\",'Offerte goederen'!Y39,IF(C16=\"M\",'Offerte montage'!S39,\"\"))","v":""}]
[{"$f":"'Offerte goederen'!B40","v":0},{"$f":"CONCATENATE(IF('Offerte goederen'!C40=0,\"\",CONCATENATE('Offerte goederen'!C40,\", \")),IF('Offerte goederen'!O40=0,\"\",CONCATENATE(\"merk: \",'Offerte goederen'!O40)),IF('Offerte goederen'!N40=0,\"\",CONCATENATE(\", omschrijving: \",'Offerte goederen'!N40)),IF('Offerte goederen'!H40=0,\"\",CONCATENATE(\", plooi: \",'Offerte goederen'!H40)),IF('Offerte goederen'!J40=0,\"\",CONCATENATE(\", railtype: \",'Offerte goederen'!J40)),IF('Offerte goederen'!K40=0,\"\",CONCATENATE(\", railkleur: \",'Offerte goederen'!K40)))","v":""},"G",{"$f":"'Offerte goederen'!P40","v":0},null,{"$f":"IF(C17=\"G\",'Offerte goederen'!R40,IF(C17=\"M\",'Offerte montage'!L40,\"\"))","v":0},{"$f":"IF(C17=\"G\",'Offerte goederen'!S40,IF(C17=\"M\",'Offerte montage'!M40,\"\"))","v":0},null,{"$f":"IF(C17=\"G\",'Offerte goederen'!U40,IF(C17=\"M\",'Offerte montage'!O40,\"\"))","v":0},null,{"$f":"IF(C17=\"G\",'Offerte goederen'!W40,IF(C17=\"M\",'Offerte montage'!Q40,\"\"))","v":""},null,{"$f":"IF(C17=\"G\",'Offerte goederen'!Y40,IF(C17=\"M\",'Offerte montage'!S40,\"\"))","v":""}]
[{"$f":"'Offerte goederen'!B41","v":0},{"$f":"CONCATENATE(IF('Offerte goederen'!C41=0,\"\",CONCATENATE('Offerte goederen'!C41,\", \")),IF('Offerte goederen'!O41=0,\"\",CONCATENATE(\"merk: \",'Offerte goederen'!O41)),IF('Offerte goederen'!N41=0,\"\",CONCATENATE(\", omschrijving: \",'Offerte goederen'!N41)),IF('Offerte goederen'!H41=0,\"\",CONCATENATE(\", plooi: \",'Offerte goederen'!H41)),IF('Offerte goederen'!J41=0,\"\",CONCATENATE(\", railtype: \",'Offerte goederen'!J41)),IF('Offerte goederen'!K41=0,\"\",CONCATENATE(\", railkleur: \",'Offerte goederen'!K41)))","v":""},"G",{"$f":"'Offerte goederen'!P41","v":0},null,{"$f":"IF(C18=\"G\",'Offerte goederen'!R41,IF(C18=\"M\",'Offerte montage'!L41,\"\"))","v":0},{"$f":"IF(C18=\"G\",'Offerte goederen'!S41,IF(C18=\"M\",'Offerte montage'!M41,\"\"))","v":0},null,{"$f":"IF(C18=\"G\",'Offerte goederen'!U41,IF(C18=\"M\",'Offerte montage'!O41,\"\"))","v":0},null,{"$f":"IF(C18=\"G\",'Offerte goederen'!W41,IF(C18=\"M\",'Offerte montage'!Q41,\"\"))","v":""},null,{"$f":"IF(C18=\"G\",'Offerte goederen'!Y41,IF(C18=\"M\",'Offerte montage'!S41,\"\"))","v":""}]
[{"$f":"'Offerte goederen'!B42","v":0},{"$f":"CONCATENATE(IF('Offerte goederen'!C42=0,\"\",CONCATENATE('Offerte goederen'!C42,\", \")),IF('Offerte goederen'!O42=0,\"\",CONCATENATE(\"merk: \",'Offerte goederen'!O42)),IF('Offerte goederen'!N42=0,\"\",CONCATENATE(\", omschrijving: \",'Offerte goederen'!N42)),IF('Offerte goederen'!H42=0,\"\",CONCATENATE(\", plooi: \",'Offerte goederen'!H42)),IF('Offerte goederen'!J42=0,\"\",CONCATENATE(\", railtype: \",'Offerte goederen'!J42)),IF('Offerte goederen'!K42=0,\"\",CONCATENATE(\", railkleur: \",'Offerte goederen'!K42)))","v":""},"G",{"$f":"'Offerte goederen'!P42","v":0},null,{"$f":"IF(C19=\"G\",'Offerte goederen'!R42,IF(C19=\"M\",'Offerte montage'!L42,\"\"))","v":0},{"$f":"IF(C19=\"G\",'Offerte goederen'!S42,IF(C19=\"M\",'Offerte montage'!M42,\"\"))","v":0},null,{"$f":"IF(C19=\"G\",'Offerte goederen'!U42,IF(C19=\"M\",'Offerte montage'!O42,\"\"))","v":0},null,{"$f":"IF(C19=\"G\",'Offerte goederen'!W42,IF(C19=\"M\",'Offerte montage'!Q42,\"\"))","v":""},null,{"$f":"IF(C19=\"G\",'Offerte goederen'!Y42,IF(C19=\"M\",'Offerte montage'!S42,\"\"))","v":""}]
[{"$f":"'Offerte goederen'!B43","v":0},{"$f":"CONCATENATE(IF('Offerte goederen'!C43=0,\"\",CONCATENATE('Offerte goederen'!C43,\", \")),IF('Offerte goederen'!O43=0,\"\",CONCATENATE(\"merk: \",'Offerte goederen'!O43)),IF('Offerte goederen'!N43=0,\"\",CONCATENATE(\", omschrijving: \",'Offerte goederen'!N43)),IF('Offerte goederen'!H43=0,\"\",CONCATENATE(\", plooi: \",'Offerte goederen'!H43)),IF('Offerte goederen'!J43=0,\"\",CONCATENATE(\", railtype: \",'Offerte goederen'!J43)),IF('Offerte goederen'!K43=0,\"\",CONCATENATE(\", railkleur: \",'Offerte goederen'!K43)))","v":""},"G",{"$f":"'Offerte goederen'!P43","v":0},null,{"$f":"IF(C20=\"G\",'Offerte goederen'!R43,IF(C20=\"M\",'Offerte montage'!L43,\"\"))","v":0},{"$f":"IF(C20=\"G\",'Offerte goederen'!S43,IF(C20=\"M\",'Offerte montage'!M43,\"\"))","v":0},null,{"$f":"IF(C20=\"G\",'Offerte goederen'!U43,IF(C20=\"M\",'Offerte montage'!O43,\"\"))","v":0},null,{"$f":"IF(C20=\"G\",'Offerte goederen'!W43,IF(C20=\"M\",'Offerte montage'!Q43,\"\"))","v":""},null,{"$f":"IF(C20=\"G\",'Offerte goederen'!Y43,IF(C20=\"M\",'Offerte montage'!S43,\"\"))","v":""}]
[{"$f":"'Offerte goederen'!B44","v":0},{"$f":"CONCATENATE(IF('Offerte goederen'!C44=0,\"\",CONCATENATE('Offerte goederen'!C44,\", \")),IF('Offerte goederen'!O44=0,\"\",CONCATENATE(\"merk: \",'Offerte goederen'!O44)),IF('Offerte goederen'!N44=0,\"\",CONCATENATE(\", omschrijving: \",'Offerte goederen'!N44)),IF('Offerte goederen'!H44=0,\"\",CONCATENATE(\", plooi: \",'Offerte goederen'!H44)),IF('Offerte goederen'!J44=0,\"\",CONCATENATE(\", railtype: \",'Offerte goederen'!J44)),IF('Offerte goederen'!K44=0,\"\",CONCATENATE(\", railkleur: \",'Offerte goederen'!K44)))","v":""},"G",{"$f":"'Offerte goederen'!P44","v":0},null,{"$f":"IF(C21=\"G\",'Offerte goederen'!R44,IF(C21=\"M\",'Offerte montage'!L44,\"\"))","v":0},{"$f":"IF(C21=\"G\",'Offerte goederen'!S44,IF(C21=\"M\",'Offerte montage'!M44,\"\"))","v":0},null,{"$f":"IF(C21=\"G\",'Offerte goederen'!U44,IF(C21=\"M\",'Offerte montage'!O44,\"\"))","v":0},null,{"$f":"IF(C21=\"G\",'Offerte goederen'!W44,IF(C21=\"M\",'Offerte montage'!Q44,\"\"))","v":""},null,{"$f":"IF(C21=\"G\",'Offerte goederen'!Y44,IF(C21=\"M\",'Offerte montage'!S44,\"\"))","v":""}]
[{"$f":"'Offerte goederen'!B45","v":0},{"$f":"CONCATENATE(IF('Offerte goederen'!C45=0,\"\",CONCATENATE('Offerte goederen'!C45,\", \")),IF('Offerte goederen'!O45=0,\"\",CONCATENATE(\"merk: \",'Offerte goederen'!O45)),IF('Offerte goederen'!N45=0,\"\",CONCATENATE(\", omschrijving: \",'Offerte goederen'!N45)),IF('Offerte goederen'!H45=0,\"\",CONCATENATE(\", plooi: \",'Offerte goederen'!H45)),IF('Offerte goederen'!J45=0,\"\",CONCATENATE(\", railtype: \",'Offerte goederen'!J45)),IF('Offerte goederen'!K45=0,\"\",CONCATENATE(\", railkleur: \",'Offerte goederen'!K45)))","v":""},"G",{"$f":"'Offerte goederen'!P45","v":0},null,{"$f":"IF(C22=\"G\",'Offerte goederen'!R45,IF(C22=\"M\",'Offerte montage'!L45,\"\"))","v":0},{"$f":"IF(C22=\"G\",'Offerte goederen'!S45,IF(C22=\"M\",'Offerte montage'!M45,\"\"))","v":0},null,{"$f":"IF(C22=\"G\",'Offerte goederen'!U45,IF(C22=\"M\",'Offerte montage'!O45,\"\"))","v":0},null,{"$f":"IF(C22=\"G\",'Offerte goederen'!W45,IF(C22=\"M\",'Offerte montage'!Q45,\"\"))","v":""},null,{"$f":"IF(C22=\"G\",'Offerte goederen'!Y45,IF(C22=\"M\",'Offerte montage'!S45,\"\"))","v":""}]
[{"$f":"'Offerte goederen'!B46","v":0},{"$f":"CONCATENATE(IF('Offerte goederen'!C46=0,\"\",CONCATENATE('Offerte goederen'!C46,\", \")),IF('Offerte goederen'!O46=0,\"\",CONCATENATE(\"merk: \",'Offerte goederen'!O46)),IF('Offerte goederen'!N46=0,\"\",CONCATENATE(\", omschrijving: \",'Offerte goederen'!N46)),IF('Offerte goederen'!H46=0,\"\",CONCATENATE(\", plooi: \",'Offerte goederen'!H46)),IF('Offerte goederen'!J46=0,\"\",CONCATENATE(\", railtype: \",'Offerte goederen'!J46)),IF('Offerte goederen'!K46=0,\"\",CONCATENATE(\", railkleur: \",'Offerte goederen'!K46)))","v":""},"G",{"$f":"'Offerte goederen'!P46","v":0},null,{"$f":"IF(C23=\"G\",'Offerte goederen'!R46,IF(C23=\"M\",'Offerte montage'!L46,\"\"))","v":0},{"$f":"IF(C23=\"G\",'Offerte goederen'!S46,IF(C23=\"M\",'Offerte montage'!M46,\"\"))","v":0},null,{"$f":"IF(C23=\"G\",'Offerte goederen'!U46,IF(C23=\"M\",'Offerte montage'!O46,\"\"))","v":0},null,{"$f":"IF(C23=\"G\",'Offerte goederen'!W46,IF(C23=\"M\",'Offerte montage'!Q46,\"\"))","v":""},null,{"$f":"IF(C23=\"G\",'Offerte goederen'!Y46,IF(C23=\"M\",'Offerte montage'!S46,\"\"))","v":""}]
[{"$f":"'Offerte goederen'!B47","v":0},{"$f":"CONCATENATE(IF('Offerte goederen'!C47=0,\"\",CONCATENATE('Offerte goederen'!C47,\", \")),IF('Offerte goederen'!O47=0,\"\",CONCATENATE(\"merk: \",'Offerte goederen'!O47)),IF('Offerte goederen'!N47=0,\"\",CONCATENATE(\", omschrijving: \",'Offerte goederen'!N47)),IF('Offerte goederen'!H47=0,\"\",CONCATENATE(\", plooi: \",'Offerte goederen'!H47)),IF('Offerte goederen'!J47=0,\"\",CONCATENATE(\", railtype: \",'Offerte goederen'!J47)),IF('Offerte goederen'!K47=0,\"\",CONCATENATE(\", railkleur: \",'Offerte goederen'!K47)))","v":""},"G",{"$f":"'Offerte goederen'!P47","v":0},null,{"$f":"IF(C24=\"G\",'Offerte goederen'!R47,IF(C24=\"M\",'Offerte montage'!L47,\"\"))","v":0},{"$f":"IF(C24=\"G\",'Offerte goederen'!S47,IF(C24=\"M\",'Offerte montage'!M47,\"\"))","v":0},null,{"$f":"IF(C24=\"G\",'Offerte goederen'!U47,IF(C24=\"M\",'Offerte montage'!O47,\"\"))","v":0},null,{"$f":"IF(C24=\"G\",'Offerte goederen'!W47,IF(C24=\"M\",'Offerte montage'!Q47,\"\"))","v":""},null,{"$f":"IF(C24=\"G\",'Offerte goederen'!Y47,IF(C24=\"M\",'Offerte montage'!S47,\"\"))","v":""}]
[{"$f":"'Offerte goederen'!B48","v":0},{"$f":"CONCATENATE(IF('Offerte goederen'!C48=0,\"\",CONCATENATE('Offerte goederen'!C48,\", \")),IF('Offerte goederen'!O48=0,\"\",CONCATENATE(\"merk: \",'Offerte goederen'!O48)),IF('Offerte goederen'!N48=0,\"\",CONCATENATE(\", omschrijving: \",'Offerte goederen'!N48)),IF('Offerte goederen'!H48=0,\"\",CONCATENATE(\", plooi: \",'Offerte goederen'!H48)),IF('Offerte goederen'!J48=0,\"\",CONCATENATE(\", railtype: \",'Offerte goederen'!J48)),IF('Offerte goederen'!K48=0,\"\",CONCATENATE(\", railkleur: \",'Offerte goederen'!K48)))","v":""},"G",{"$f":"'Offerte goederen'!P48","v":0},null,{"$f":"IF(C25=\"G\",'Offerte goederen'!R48,IF(C25=\"M\",'Offerte montage'!L48,\"\"))","v":0},{"$f":"IF(C25=\"G\",'Offerte goederen'!S48,IF(C25=\"M\",'Offerte montage'!M48,\"\"))","v":0},null,{"$f":"IF(C25=\"G\",'Offerte goederen'!U48,IF(C25=\"M\",'Offerte montage'!O48,\"\"))","v":0},null,{"$f":"IF(C25=\"G\",'Offerte goederen'!W48,IF(C25=\"M\",'Offerte montage'!Q48,\"\"))","v":""},null,{"$f":"IF(C25=\"G\",'Offerte goederen'!Y48,IF(C25=\"M\",'Offerte montage'!S48,\"\"))","v":""}]
[{"$f":"'Offerte goederen'!B49","v":0},{"$f":"CONCATENATE(IF('Offerte goederen'!C49=0,\"\",CONCATENATE('Offerte goederen'!C49,\", \")),IF('Offerte goederen'!O49=0,\"\",CONCATENATE(\"merk: \",'Offerte goederen'!O49)),IF('Offerte goederen'!N49=0,\"\",CONCATENATE(\", omschrijving: \",'Offerte goederen'!N49)),IF('Offerte goederen'!H49=0,\"\",CONCATENATE(\", plooi: \",'Offerte goederen'!H49)),IF('Offerte goederen'!J49=0,\"\",CONCATENATE(\", railtype: \",'Offerte goederen'!J49)),IF('Offerte goederen'!K49=0,\"\",CONCATENATE(\", railkleur: \",'Offerte goederen'!K49)))","v":""},"G",{"$f":"'Offerte goederen'!P49","v":0},null,{"$f":"IF(C26=\"G\",'Offerte goederen'!R49,IF(C26=\"M\",'Offerte montage'!L49,\"\"))","v":0},{"$f":"IF(C26=\"G\",'Offerte goederen'!S49,IF(C26=\"M\",'Offerte montage'!M49,\"\"))","v":0},null,{"$f":"IF(C26=\"G\",'Offerte goederen'!U49,IF(C26=\"M\",'Offerte montage'!O49,\"\"))","v":0},null,{"$f":"IF(C26=\"G\",'Offerte goederen'!W49,IF(C26=\"M\",'Offerte montage'!Q49,\"\"))","v":""},null,{"$f":"IF(C26=\"G\",'Offerte goederen'!Y49,IF(C26=\"M\",'Offerte montage'!S49,\"\"))","v":""}]
[{"$f":"'Offerte goederen'!B50","v":0},{"$f":"CONCATENATE(IF('Offerte goederen'!C50=0,\"\",CONCATENATE('Offerte goederen'!C50,\", \")),IF('Offerte goederen'!O50=0,\"\",CONCATENATE(\"merk: \",'Offerte goederen'!O50)),IF('Offerte goederen'!N50=0,\"\",CONCATENATE(\", omschrijving: \",'Offerte goederen'!N50)),IF('Offerte goederen'!H50=0,\"\",CONCATENATE(\", plooi: \",'Offerte goederen'!H50)),IF('Offerte goederen'!J50=0,\"\",CONCATENATE(\", railtype: \",'Offerte goederen'!J50)),IF('Offerte goederen'!K50=0,\"\",CONCATENATE(\", railkleur: \",'Offerte goederen'!K50)))","v":""},"G",{"$f":"'Offerte goederen'!P50","v":0},null,{"$f":"IF(C27=\"G\",'Offerte goederen'!R50,IF(C27=\"M\",'Offerte montage'!L50,\"\"))","v":0},{"$f":"IF(C27=\"G\",'Offerte goederen'!S50,IF(C27=\"M\",'Offerte montage'!M50,\"\"))","v":0},null,{"$f":"IF(C27=\"G\",'Offerte goederen'!U50,IF(C27=\"M\",'Offerte montage'!O50,\"\"))","v":0},null,{"$f":"IF(C27=\"G\",'Offerte goederen'!W50,IF(C27=\"M\",'Offerte montage'!Q50,\"\"))","v":""},null,{"$f":"IF(C27=\"G\",'Offerte goederen'!Y50,IF(C27=\"M\",'Offerte montage'!S50,\"\"))","v":""}]
[{"$f":"'Offerte goederen'!B51","v":0},{"$f":"CONCATENATE(IF('Offerte goederen'!C51=0,\"\",CONCATENATE('Offerte goederen'!C51,\", \")),IF('Offerte goederen'!O51=0,\"\",CONCATENATE(\"merk: \",'Offerte goederen'!O51)),IF('Offerte goederen'!N51=0,\"\",CONCATENATE(\", omschrijving: \",'Offerte goederen'!N51)),IF('Offerte goederen'!H51=0,\"\",CONCATENATE(\", plooi: \",'Offerte goederen'!H51)),IF('Offerte goederen'!J51=0,\"\",CONCATENATE(\", railtype: \",'Offerte goederen'!J51)),IF('Offerte goederen'!K51=0,\"\",CONCATENATE(\", railkleur: \",'Offerte goederen'!K51)))","v":""},"G",{"$f":"'Offerte goederen'!P51","v":0},null,{"$f":"IF(C28=\"G\",'Offerte goederen'!R51,IF(C28=\"M\",'Offerte montage'!L51,\"\"))","v":0},{"$f":"IF(C28=\"G\",'Offerte goederen'!S51,IF(C28=\"M\",'Offerte montage'!M51,\"\"))","v":0},null,{"$f":"IF(C28=\"G\",'Offerte goederen'!U51,IF(C28=\"M\",'Offerte montage'!O51,\"\"))","v":0},null,{"$f":"IF(C28=\"G\",'Offerte goederen'!W51,IF(C28=\"M\",'Offerte montage'!Q51,\"\"))","v":""},null,{"$f":"IF(C28=\"G\",'Offerte goederen'!Y51,IF(C28=\"M\",'Offerte montage'!S51,\"\"))","v":""}]
[{"$f":"'Offerte goederen'!B52","v":0},{"$f":"CONCATENATE(IF('Offerte goederen'!C52=0,\"\",CONCATENATE('Offerte goederen'!C52,\", \")),IF('Offerte goederen'!O52=0,\"\",CONCATENATE(\"merk: \",'Offerte goederen'!O52)),IF('Offerte goederen'!N52=0,\"\",CONCATENATE(\", omschrijving: \",'Offerte goederen'!N52)),IF('Offerte goederen'!H52=0,\"\",CONCATENATE(\", plooi: \",'Offerte goederen'!H52)),IF('Offerte goederen'!J52=0,\"\",CONCATENATE(\", railtype: \",'Offerte goederen'!J52)),IF('Offerte goederen'!K52=0,\"\",CONCATENATE(\", railkleur: \",'Offerte goederen'!K52)))","v":""},"G",{"$f":"'Offerte goederen'!P52","v":0},null,{"$f":"IF(C29=\"G\",'Offerte goederen'!R52,IF(C29=\"M\",'Offerte montage'!L52,\"\"))","v":0},{"$f":"IF(C29=\"G\",'Offerte goederen'!S52,IF(C29=\"M\",'Offerte montage'!M52,\"\"))","v":0},null,{"$f":"IF(C29=\"G\",'Offerte goederen'!U52,IF(C29=\"M\",'Offerte montage'!O52,\"\"))","v":0},null,{"$f":"IF(C29=\"G\",'Offerte goederen'!W52,IF(C29=\"M\",'Offerte montage'!Q52,\"\"))","v":""},null,{"$f":"IF(C29=\"G\",'Offerte goederen'!Y52,IF(C29=\"M\",'Offerte montage'!S52,\"\"))","v":""}]
[{"$f":"'Offerte goederen'!B53","v":0},{"$f":"CONCATENATE(IF('Offerte goederen'!C53=0,\"\",CONCATENATE('Offerte goederen'!C53,\", \")),IF('Offerte goederen'!O53=0,\"\",CONCATENATE(\"merk: \",'Offerte goederen'!O53)),IF('Offerte goederen'!N53=0,\"\",CONCATENATE(\", omschrijving: \",'Offerte goederen'!N53)),IF('Offerte goederen'!H53=0,\"\",CONCATENATE(\", plooi: \",'Offerte goederen'!H53)),IF('Offerte goederen'!J53=0,\"\",CONCATENATE(\", railtype: \",'Offerte goederen'!J53)),IF('Offerte goederen'!K53=0,\"\",CONCATENATE(\", railkleur: \",'Offerte goederen'!K53)))","v":""},"G",{"$f":"'Offerte goederen'!P53","v":0},null,{"$f":"IF(C30=\"G\",'Offerte goederen'!R53,IF(C30=\"M\",'Offerte montage'!L53,\"\"))","v":0},{"$f":"IF(C30=\"G\",'Offerte goederen'!S53,IF(C30=\"M\",'Offerte montage'!M53,\"\"))","v":0},null,{"$f":"IF(C30=\"G\",'Offerte goederen'!U53,IF(C30=\"M\",'Offerte montage'!O53,\"\"))","v":0},null,{"$f":"IF(C30=\"G\",'Offerte goederen'!W53,IF(C30=\"M\",'Offerte montage'!Q53,\"\"))","v":""},null,{"$f":"IF(C30=\"G\",'Offerte goederen'!Y53,IF(C30=\"M\",'Offerte montage'!S53,\"\"))","v":""}]
[{"$f":"'Offerte goederen'!B54","v":0},{"$f":"CONCATENATE(IF('Offerte goederen'!C54=0,\"\",CONCATENATE('Offerte goederen'!C54,\", \")),IF('Offerte goederen'!O54=0,\"\",CONCATENATE(\"merk: \",'Offerte goederen'!O54)),IF('Offerte goederen'!N54=0,\"\",CONCATENATE(\", omschrijving: \",'Offerte goederen'!N54)),IF('Offerte goederen'!H54=0,\"\",CONCATENATE(\", plooi: \",'Offerte goederen'!H54)),IF('Offerte goederen'!J54=0,\"\",CONCATENATE(\", railtype: \",'Offerte goederen'!J54)),IF('Offerte goederen'!K54=0,\"\",CONCATENATE(\", railkleur: \",'Offerte goederen'!K54)))","v":""},"G",{"$f":"'Offerte goederen'!P54","v":0},null,{"$f":"IF(C31=\"G\",'Offerte goederen'!R54,IF(C31=\"M\",'Offerte montage'!L54,\"\"))","v":0},{"$f":"IF(C31=\"G\",'Offerte goederen'!S54,IF(C31=\"M\",'Offerte montage'!M54,\"\"))","v":0},null,{"$f":"IF(C31=\"G\",'Offerte goederen'!U54,IF(C31=\"M\",'Offerte montage'!O54,\"\"))","v":0},null,{"$f":"IF(C31=\"G\",'Offerte goederen'!W54,IF(C31=\"M\",'Offerte montage'!Q54,\"\"))","v":""},null,{"$f":"IF(C31=\"G\",'Offerte goederen'!Y54,IF(C31=\"M\",'Offerte montage'!S54,\"\"))","v":""}]
[{"$f":"'Offerte goederen'!B55","v":0},{"$f":"CONCATENATE(IF('Offerte goederen'!C55=0,\"\",CONCATENATE('Offerte goederen'!C55,\", \")),IF('Offerte goederen'!O55=0,\"\",CONCATENATE(\"merk: \",'Offerte goederen'!O55)),IF('Offerte goederen'!N55=0,\"\",CONCATENATE(\", omschrijving: \",'Offerte goederen'!N55)),IF('Offerte goederen'!H55=0,\"\",CONCATENATE(\", plooi: \",'Offerte goederen'!H55)),IF('Offerte goederen'!J55=0,\"\",CONCATENATE(\", railtype: \",'Offerte goederen'!J55)),IF('Offerte goederen'!K55=0,\"\",CONCATENATE(\", railkleur: \",'Offerte goederen'!K55)))","v":""},"G",{"$f":"'Offerte goederen'!P55","v":0},null,{"$f":"IF(C32=\"G\",'Offerte goederen'!R55,IF(C32=\"M\",'Offerte montage'!L55,\"\"))","v":0},{"$f":"IF(C32=\"G\",'Offerte goederen'!S55,IF(C32=\"M\",'Offerte montage'!M55,\"\"))","v":0},null,{"$f":"IF(C32=\"G\",'Offerte goederen'!U55,IF(C32=\"M\",'Offerte montage'!O55,\"\"))","v":0},null,{"$f":"IF(C32=\"G\",'Offerte goederen'!W55,IF(C32=\"M\",'Offerte montage'!Q55,\"\"))","v":""},null,{"$f":"IF(C32=\"G\",'Offerte goederen'!Y55,IF(C32=\"M\",'Offerte montage'!S55,\"\"))","v":""}]
[{"$f":"'Offerte goederen'!B56","v":0},{"$f":"CONCATENATE(IF('Offerte goederen'!C56=0,\"\",CONCATENATE('Offerte goederen'!C56,\", \")),IF('Offerte goederen'!O56=0,\"\",CONCATENATE(\"merk: \",'Offerte goederen'!O56)),IF('Offerte goederen'!N56=0,\"\",CONCATENATE(\", omschrijving: \",'Offerte goederen'!N56)),IF('Offerte goederen'!H56=0,\"\",CONCATENATE(\", plooi: \",'Offerte goederen'!H56)),IF('Offerte goederen'!J56=0,\"\",CONCATENATE(\", railtype: \",'Offerte goederen'!J56)),IF('Offerte goederen'!K56=0,\"\",CONCATENATE(\", railkleur: \",'Offerte goederen'!K56)))","v":""},"G",{"$f":"'Offerte goederen'!P56","v":0},null,{"$f":"IF(C33=\"G\",'Offerte goederen'!R56,IF(C33=\"M\",'Offerte montage'!L56,\"\"))","v":0},{"$f":"IF(C33=\"G\",'Offerte goederen'!S56,IF(C33=\"M\",'Offerte montage'!M56,\"\"))","v":0},null,{"$f":"IF(C33=\"G\",'Offerte goederen'!U56,IF(C33=\"M\",'Offerte montage'!O56,\"\"))","v":0},null,{"$f":"IF(C33=\"G\",'Offerte goederen'!W56,IF(C33=\"M\",'Offerte montage'!Q56,\"\"))","v":""},null,{"$f":"IF(C33=\"G\",'Offerte goederen'!Y56,IF(C33=\"M\",'Offerte montage'!S56,\"\"))","v":""}]
[{"$f":"'Offerte goederen'!B57","v":0},{"$f":"CONCATENATE(IF('Offerte goederen'!C57=0,\"\",CONCATENATE('Offerte goederen'!C57,\", \")),IF('Offerte goederen'!O57=0,\"\",CONCATENATE(\"merk: \",'Offerte goederen'!O57)),IF('Offerte goederen'!N57=0,\"\",CONCATENATE(\", omschrijving: \",'Offerte goederen'!N57)),IF('Offerte goederen'!H57=0,\"\",CONCATENATE(\", plooi: \",'Offerte goederen'!H57)),IF('Offerte goederen'!J57=0,\"\",CONCATENATE(\", railtype: \",'Offerte goederen'!J57)),IF('Offerte goederen'!K57=0,\"\",CONCATENATE(\", railkleur: \",'Offerte goederen'!K57)))","v":""},"G",{"$f":"'Offerte goederen'!P57","v":0},null,{"$f":"IF(C34=\"G\",'Offerte goederen'!R57,IF(C34=\"M\",'Offerte montage'!L57,\"\"))","v":0},{"$f":"IF(C34=\"G\",'Offerte goederen'!S57,IF(C34=\"M\",'Offerte montage'!M57,\"\"))","v":0},null,{"$f":"IF(C34=\"G\",'Offerte goederen'!U57,IF(C34=\"M\",'Offerte montage'!O57,\"\"))","v":0},null,{"$f":"IF(C34=\"G\",'Offerte goederen'!W57,IF(C34=\"M\",'Offerte montage'!Q57,\"\"))","v":""},null,{"$f":"IF(C34=\"G\",'Offerte goederen'!Y57,IF(C34=\"M\",'Offerte montage'!S57,\"\"))","v":""}]
[{"$f":"'Offerte goederen'!B58","v":0},{"$f":"CONCATENATE(IF('Offerte goederen'!C58=0,\"\",CONCATENATE('Offerte goederen'!C58,\", \")),IF('Offerte goederen'!O58=0,\"\",CONCATENATE(\"merk: \",'Offerte goederen'!O58)),IF('Offerte goederen'!N58=0,\"\",CONCATENATE(\", omschrijving: \",'Offerte goederen'!N58)),IF('Offerte goederen'!H58=0,\"\",CONCATENATE(\", plooi: \",'Offerte goederen'!H58)),IF('Offerte goederen'!J58=0,\"\",CONCATENATE(\", railtype: \",'Offerte goederen'!J58)),IF('Offerte goederen'!K58=0,\"\",CONCATENATE(\", railkleur: \",'Offerte goederen'!K58)))","v":""},"G",{"$f":"'Offerte goederen'!P58","v":0},null,{"$f":"IF(C35=\"G\",'Offerte goederen'!R58,IF(C35=\"M\",'Offerte montage'!L58,\"\"))","v":0},{"$f":"IF(C35=\"G\",'Offerte goederen'!S58,IF(C35=\"M\",'Offerte montage'!M58,\"\"))","v":0},null,{"$f":"IF(C35=\"G\",'Offerte goederen'!U58,IF(C35=\"M\",'Offerte montage'!O58,\"\"))","v":0},null,{"$f":"IF(C35=\"G\",'Offerte goederen'!W58,IF(C35=\"M\",'Offerte montage'!Q58,\"\"))","v":""},null,{"$f":"IF(C35=\"G\",'Offerte goederen'!Y58,IF(C35=\"M\",'Offerte montage'!S58,\"\"))","v":""}]
[{"$f":"'Offerte goederen'!B59","v":0},{"$f":"CONCATENATE(IF('Offerte goederen'!C59=0,\"\",CONCATENATE('Offerte goederen'!C59,\", \")),IF('Offerte goederen'!O59=0,\"\",CONCATENATE(\"merk: \",'Offerte goederen'!O59)),IF('Offerte goederen'!N59=0,\"\",CONCATENATE(\", omschrijving: \",'Offerte goederen'!N59)),IF('Offerte goederen'!H59=0,\"\",CONCATENATE(\", plooi: \",'Offerte goederen'!H59)),IF('Offerte goederen'!J59=0,\"\",CONCATENATE(\", railtype: \",'Offerte goederen'!J59)),IF('Offerte goederen'!K59=0,\"\",CONCATENATE(\", railkleur: \",'Offerte goederen'!K59)))","v":""},"G",{"$f":"'Offerte goederen'!P59","v":0},null,{"$f":"IF(C36=\"G\",'Offerte goederen'!R59,IF(C36=\"M\",'Offerte montage'!L59,\"\"))","v":0},{"$f":"IF(C36=\"G\",'Offerte goederen'!S59,IF(C36=\"M\",'Offerte montage'!M59,\"\"))","v":0},null,{"$f":"IF(C36=\"G\",'Offerte goederen'!U59,IF(C36=\"M\",'Offerte montage'!O59,\"\"))","v":0},null,{"$f":"IF(C36=\"G\",'Offerte goederen'!W59,IF(C36=\"M\",'Offerte montage'!Q59,\"\"))","v":""},null,{"$f":"IF(C36=\"G\",'Offerte goederen'!Y59,IF(C36=\"M\",'Offerte montage'!S59,\"\"))","v":""}]
[{"$f":"'Offerte goederen'!B60","v":0},{"$f":"CONCATENATE(IF('Offerte goederen'!C60=0,\"\",CONCATENATE('Offerte goederen'!C60,\", \")),IF('Offerte goederen'!O60=0,\"\",CONCATENATE(\"merk: \",'Offerte goederen'!O60)),IF('Offerte goederen'!N60=0,\"\",CONCATENATE(\", omschrijving: \",'Offerte goederen'!N60)),IF('Offerte goederen'!H60=0,\"\",CONCATENATE(\", plooi: \",'Offerte goederen'!H60)),IF('Offerte goederen'!J60=0,\"\",CONCATENATE(\", railtype: \",'Offerte goederen'!J60)),IF('Offerte goederen'!K60=0,\"\",CONCATENATE(\", railkleur: \",'Offerte goederen'!K60)))","v":""},"G",{"$f":"'Offerte goederen'!P60","v":0},null,{"$f":"IF(C37=\"G\",'Offerte goederen'!R60,IF(C37=\"M\",'Offerte montage'!L60,\"\"))","v":0},{"$f":"IF(C37=\"G\",'Offerte goederen'!S60,IF(C37=\"M\",'Offerte montage'!M60,\"\"))","v":0},null,{"$f":"IF(C37=\"G\",'Offerte goederen'!U60,IF(C37=\"M\",'Offerte montage'!O60,\"\"))","v":0},null,{"$f":"IF(C37=\"G\",'Offerte goederen'!W60,IF(C37=\"M\",'Offerte montage'!Q60,\"\"))","v":""},null,{"$f":"IF(C37=\"G\",'Offerte goederen'!Y60,IF(C37=\"M\",'Offerte montage'!S60,\"\"))","v":""}]
[{"$f":"'Offerte goederen'!B61","v":0},{"$f":"CONCATENATE(IF('Offerte goederen'!C61=0,\"\",CONCATENATE('Offerte goederen'!C61,\", \")),IF('Offerte goederen'!O61=0,\"\",CONCATENATE(\"merk: \",'Offerte goederen'!O61)),IF('Offerte goederen'!N61=0,\"\",CONCATENATE(\", omschrijving: \",'Offerte goederen'!N61)),IF('Offerte goederen'!H61=0,\"\",CONCATENATE(\", plooi: \",'Offerte goederen'!H61)),IF('Offerte goederen'!J61=0,\"\",CONCATENATE(\", railtype: \",'Offerte goederen'!J61)),IF('Offerte goederen'!K61=0,\"\",CONCATENATE(\", railkleur: \",'Offerte goederen'!K61)))","v":""},"G",{"$f":"'Offerte goederen'!P61","v":0},null,{"$f":"IF(C38=\"G\",'Offerte goederen'!R61,IF(C38=\"M\",'Offerte montage'!L61,\"\"))","v":0},{"$f":"IF(C38=\"G\",'Offerte goederen'!S61,IF(C38=\"M\",'Offerte montage'!M61,\"\"))","v":0},null,{"$f":"IF(C38=\"G\",'Offerte goederen'!U61,IF(C38=\"M\",'Offerte montage'!O61,\"\"))","v":0},null,{"$f":"IF(C38=\"G\",'Offerte goederen'!W61,IF(C38=\"M\",'Offerte montage'!Q61,\"\"))","v":""},null,{"$f":"IF(C38=\"G\",'Offerte goederen'!Y61,IF(C38=\"M\",'Offerte montage'!S61,\"\"))","v":""}]
[{"$f":"'Offerte goederen'!B62","v":0},{"$f":"CONCATENATE(IF('Offerte goederen'!C62=0,\"\",CONCATENATE('Offerte goederen'!C62,\", \")),IF('Offerte goederen'!O62=0,\"\",CONCATENATE(\"merk: \",'Offerte goederen'!O62)),IF('Offerte goederen'!N62=0,\"\",CONCATENATE(\", omschrijving: \",'Offerte goederen'!N62)),IF('Offerte goederen'!H62=0,\"\",CONCATENATE(\", plooi: \",'Offerte goederen'!H62)),IF('Offerte goederen'!J62=0,\"\",CONCATENATE(\", railtype: \",'Offerte goederen'!J62)),IF('Offerte goederen'!K62=0,\"\",CONCATENATE(\", railkleur: \",'Offerte goederen'!K62)))","v":""},"G",{"$f":"'Offerte goederen'!P62","v":0},null,{"$f":"IF(C39=\"G\",'Offerte goederen'!R62,IF(C39=\"M\",'Offerte montage'!L62,\"\"))","v":0},{"$f":"IF(C39=\"G\",'Offerte goederen'!S62,IF(C39=\"M\",'Offerte montage'!M62,\"\"))","v":0},null,{"$f":"IF(C39=\"G\",'Offerte goederen'!U62,IF(C39=\"M\",'Offerte montage'!O62,\"\"))","v":0},null,{"$f":"IF(C39=\"G\",'Offerte goederen'!W62,IF(C39=\"M\",'Offerte montage'!Q62,\"\"))","v":""},null,{"$f":"IF(C39=\"G\",'Offerte goederen'!Y62,IF(C39=\"M\",'Offerte montage'!S62,\"\"))","v":""}]
[{"$f":"'Offerte goederen'!B63","v":0},{"$f":"CONCATENATE(IF('Offerte goederen'!C63=0,\"\",CONCATENATE('Offerte goederen'!C63,\", \")),IF('Offerte goederen'!O63=0,\"\",CONCATENATE(\"merk: \",'Offerte goederen'!O63)),IF('Offerte goederen'!N63=0,\"\",CONCATENATE(\", omschrijving: \",'Offerte goederen'!N63)),IF('Offerte goederen'!H63=0,\"\",CONCATENATE(\", plooi: \",'Offerte goederen'!H63)),IF('Offerte goederen'!J63=0,\"\",CONCATENATE(\", railtype: \",'Offerte goederen'!J63)),IF('Offerte goederen'!K63=0,\"\",CONCATENATE(\", railkleur: \",'Offerte goederen'!K63)))","v":""},"G",{"$f":"'Offerte goederen'!P63","v":0},null,{"$f":"IF(C40=\"G\",'Offerte goederen'!R63,IF(C40=\"M\",'Offerte montage'!L63,\"\"))","v":0},{"$f":"IF(C40=\"G\",'Offerte goederen'!S63,IF(C40=\"M\",'Offerte montage'!M63,\"\"))","v":0},null,{"$f":"IF(C40=\"G\",'Offerte goederen'!U63,IF(C40=\"M\",'Offerte montage'!O63,\"\"))","v":0},null,{"$f":"IF(C40=\"G\",'Offerte goederen'!W63,IF(C40=\"M\",'Offerte montage'!Q63,\"\"))","v":""},null,{"$f":"IF(C40=\"G\",'Offerte goederen'!Y63,IF(C40=\"M\",'Offerte montage'!S63,\"\"))","v":""}]
[{"$f":"'Offerte goederen'!B64","v":0},{"$f":"CONCATENATE(IF('Offerte goederen'!C64=0,\"\",CONCATENATE('Offerte goederen'!C64,\", \")),IF('Offerte goederen'!O64=0,\"\",CONCATENATE(\"merk: \",'Offerte goederen'!O64)),IF('Offerte goederen'!N64=0,\"\",CONCATENATE(\", omschrijving: \",'Offerte goederen'!N64)),IF('Offerte goederen'!H64=0,\"\",CONCATENATE(\", plooi: \",'Offerte goederen'!H64)),IF('Offerte goederen'!J64=0,\"\",CONCATENATE(\", railtype: \",'Offerte goederen'!J64)),IF('Offerte goederen'!K64=0,\"\",CONCATENATE(\", railkleur: \",'Offerte goederen'!K64)))","v":""},"G",{"$f":"'Offerte goederen'!P64","v":0},null,{"$f":"IF(C41=\"G\",'Offerte goederen'!R64,IF(C41=\"M\",'Offerte montage'!L64,\"\"))","v":0},{"$f":"IF(C41=\"G\",'Offerte goederen'!S64,IF(C41=\"M\",'Offerte montage'!M64,\"\"))","v":0},null,{"$f":"IF(C41=\"G\",'Offerte goederen'!U64,IF(C41=\"M\",'Offerte montage'!O64,\"\"))","v":0},null,{"$f":"IF(C41=\"G\",'Offerte goederen'!W64,IF(C41=\"M\",'Offerte montage'!Q64,\"\"))","v":""},null,{"$f":"IF(C41=\"G\",'Offerte goederen'!Y64,IF(C41=\"M\",'Offerte montage'!S64,\"\"))","v":""}]
[{"$f":"'Offerte goederen'!B65","v":0},{"$f":"CONCATENATE(IF('Offerte goederen'!C65=0,\"\",CONCATENATE('Offerte goederen'!C65,\", \")),IF('Offerte goederen'!O65=0,\"\",CONCATENATE(\"merk: \",'Offerte goederen'!O65)),IF('Offerte goederen'!N65=0,\"\",CONCATENATE(\", omschrijving: \",'Offerte goederen'!N65)),IF('Offerte goederen'!H65=0,\"\",CONCATENATE(\", plooi: \",'Offerte goederen'!H65)),IF('Offerte goederen'!J65=0,\"\",CONCATENATE(\", railtype: \",'Offerte goederen'!J65)),IF('Offerte goederen'!K65=0,\"\",CONCATENATE(\", railkleur: \",'Offerte goederen'!K65)))","v":""},"G",{"$f":"'Offerte goederen'!P65","v":0},null,{"$f":"IF(C42=\"G\",'Offerte goederen'!R65,IF(C42=\"M\",'Offerte montage'!L65,\"\"))","v":0},{"$f":"IF(C42=\"G\",'Offerte goederen'!S65,IF(C42=\"M\",'Offerte montage'!M65,\"\"))","v":0},null,{"$f":"IF(C42=\"G\",'Offerte goederen'!U65,IF(C42=\"M\",'Offerte montage'!O65,\"\"))","v":0},null,{"$f":"IF(C42=\"G\",'Offerte goederen'!W65,IF(C42=\"M\",'Offerte montage'!Q65,\"\"))","v":""},null,{"$f":"IF(C42=\"G\",'Offerte goederen'!Y65,IF(C42=\"M\",'Offerte montage'!S65,\"\"))","v":""}]
[{"$f":"'Offerte goederen'!B66","v":0},{"$f":"CONCATENATE(IF('Offerte goederen'!C66=0,\"\",CONCATENATE('Offerte goederen'!C66,\", \")),IF('Offerte goederen'!O66=0,\"\",CONCATENATE(\"merk: \",'Offerte goederen'!O66)),IF('Offerte goederen'!N66=0,\"\",CONCATENATE(\", omschrijving: \",'Offerte goederen'!N66)),IF('Offerte goederen'!H66=0,\"\",CONCATENATE(\", plooi: \",'Offerte goederen'!H66)),IF('Offerte goederen'!J66=0,\"\",CONCATENATE(\", railtype: \",'Offerte goederen'!J66)),IF('Offerte goederen'!K66=0,\"\",CONCATENATE(\", railkleur: \",'Offerte goederen'!K66)))","v":""},"G",{"$f":"'Offerte goederen'!P66","v":0},null,{"$f":"IF(C43=\"G\",'Offerte goederen'!R66,IF(C43=\"M\",'Offerte montage'!L66,\"\"))","v":0},{"$f":"IF(C43=\"G\",'Offerte goederen'!S66,IF(C43=\"M\",'Offerte montage'!M66,\"\"))","v":0},null,{"$f":"IF(C43=\"G\",'Offerte goederen'!U66,IF(C43=\"M\",'Offerte montage'!O66,\"\"))","v":0},null,{"$f":"IF(C43=\"G\",'Offerte goederen'!W66,IF(C43=\"M\",'Offerte montage'!Q66,\"\"))","v":""},null,{"$f":"IF(C43=\"G\",'Offerte goederen'!Y66,IF(C43=\"M\",'Offerte montage'!S66,\"\"))","v":""}]
[{"$f":"'Offerte goederen'!B67","v":0},{"$f":"CONCATENATE(IF('Offerte goederen'!C67=0,\"\",CONCATENATE('Offerte goederen'!C67,\", \")),IF('Offerte goederen'!O67=0,\"\",CONCATENATE(\"merk: \",'Offerte goederen'!O67)),IF('Offerte goederen'!N67=0,\"\",CONCATENATE(\", omschrijving: \",'Offerte goederen'!N67)),IF('Offerte goederen'!H67=0,\"\",CONCATENATE(\", plooi: \",'Offerte goederen'!H67)),IF('Offerte goederen'!J67=0,\"\",CONCATENATE(\", railtype: \",'Offerte goederen'!J67)),IF('Offerte goederen'!K67=0,\"\",CONCATENATE(\", railkleur: \",'Offerte goederen'!K67)))","v":""},"G",{"$f":"'Offerte goederen'!P67","v":0},null,{"$f":"IF(C44=\"G\",'Offerte goederen'!R67,IF(C44=\"M\",'Offerte montage'!L67,\"\"))","v":0},{"$f":"IF(C44=\"G\",'Offerte goederen'!S67,IF(C44=\"M\",'Offerte montage'!M67,\"\"))","v":0},null,{"$f":"IF(C44=\"G\",'Offerte goederen'!U67,IF(C44=\"M\",'Offerte montage'!O67,\"\"))","v":0},null,{"$f":"IF(C44=\"G\",'Offerte goederen'!W67,IF(C44=\"M\",'Offerte montage'!Q67,\"\"))","v":""},null,{"$f":"IF(C44=\"G\",'Offerte goederen'!Y67,IF(C44=\"M\",'Offerte montage'!S67,\"\"))","v":""}]
[{"$f":"'Offerte goederen'!B68","v":0},{"$f":"CONCATENATE(IF('Offerte goederen'!C68=0,\"\",CONCATENATE('Offerte goederen'!C68,\", \")),IF('Offerte goederen'!O68=0,\"\",CONCATENATE(\"merk: \",'Offerte goederen'!O68)),IF('Offerte goederen'!N68=0,\"\",CONCATENATE(\", omschrijving: \",'Offerte goederen'!N68)),IF('Offerte goederen'!H68=0,\"\",CONCATENATE(\", plooi: \",'Offerte goederen'!H68)),IF('Offerte goederen'!J68=0,\"\",CONCATENATE(\", railtype: \",'Offerte goederen'!J68)),IF('Offerte goederen'!K68=0,\"\",CONCATENATE(\", railkleur: \",'Offerte goederen'!K68)))","v":""},"G",{"$f":"'Offerte goederen'!P68","v":0},null,{"$f":"IF(C45=\"G\",'Offerte goederen'!R68,IF(C45=\"M\",'Offerte montage'!L68,\"\"))","v":0},{"$f":"IF(C45=\"G\",'Offerte goederen'!S68,IF(C45=\"M\",'Offerte montage'!M68,\"\"))","v":0},null,{"$f":"IF(C45=\"G\",'Offerte goederen'!U68,IF(C45=\"M\",'Offerte montage'!O68,\"\"))","v":0},null,{"$f":"IF(C45=\"G\",'Offerte goederen'!W68,IF(C45=\"M\",'Offerte montage'!Q68,\"\"))","v":""},null,{"$f":"IF(C45=\"G\",'Offerte goederen'!Y68,IF(C45=\"M\",'Offerte montage'!S68,\"\"))","v":""}]
[{"$f":"'Offerte goederen'!B69","v":0},{"$f":"CONCATENATE(IF('Offerte goederen'!C69=0,\"\",CONCATENATE('Offerte goederen'!C69,\", \")),IF('Offerte goederen'!O69=0,\"\",CONCATENATE(\"merk: \",'Offerte goederen'!O69)),IF('Offerte goederen'!N69=0,\"\",CONCATENATE(\", omschrijving: \",'Offerte goederen'!N69)),IF('Offerte goederen'!H69=0,\"\",CONCATENATE(\", plooi: \",'Offerte goederen'!H69)),IF('Offerte goederen'!J69=0,\"\",CONCATENATE(\", railtype: \",'Offerte goederen'!J69)),IF('Offerte goederen'!K69=0,\"\",CONCATENATE(\", railkleur: \",'Offerte goederen'!K69)))","v":""},"G",{"$f":"'Offerte goederen'!P69","v":0},null,{"$f":"IF(C46=\"G\",'Offerte goederen'!R69,IF(C46=\"M\",'Offerte montage'!L69,\"\"))","v":0},{"$f":"IF(C46=\"G\",'Offerte goederen'!S69,IF(C46=\"M\",'Offerte montage'!M69,\"\"))","v":0},null,{"$f":"IF(C46=\"G\",'Offerte goederen'!U69,IF(C46=\"M\",'Offerte montage'!O69,\"\"))","v":0},null,{"$f":"IF(C46=\"G\",'Offerte goederen'!W69,IF(C46=\"M\",'Offerte montage'!Q69,\"\"))","v":""},null,{"$f":"IF(C46=\"G\",'Offerte goederen'!Y69,IF(C46=\"M\",'Offerte montage'!S69,\"\"))","v":""}]
[{"$f":"'Offerte goederen'!B70","v":0},{"$f":"CONCATENATE(IF('Offerte goederen'!C70=0,\"\",CONCATENATE('Offerte goederen'!C70,\", \")),IF('Offerte goederen'!O70=0,\"\",CONCATENATE(\"merk: \",'Offerte goederen'!O70)),IF('Offerte goederen'!N70=0,\"\",CONCATENATE(\", omschrijving: \",'Offerte goederen'!N70)),IF('Offerte goederen'!H70=0,\"\",CONCATENATE(\", plooi: \",'Offerte goederen'!H70)),IF('Offerte goederen'!J70=0,\"\",CONCATENATE(\", railtype: \",'Offerte goederen'!J70)),IF('Offerte goederen'!K70=0,\"\",CONCATENATE(\", railkleur: \",'Offerte goederen'!K70)))","v":""},"G",{"$f":"'Offerte goederen'!P70","v":0},null,{"$f":"IF(C47=\"G\",'Offerte goederen'!R70,IF(C47=\"M\",'Offerte montage'!L70,\"\"))","v":0},{"$f":"IF(C47=\"G\",'Offerte goederen'!S70,IF(C47=\"M\",'Offerte montage'!M70,\"\"))","v":0},null,{"$f":"IF(C47=\"G\",'Offerte goederen'!U70,IF(C47=\"M\",'Offerte montage'!O70,\"\"))","v":0},null,{"$f":"IF(C47=\"G\",'Offerte goederen'!W70,IF(C47=\"M\",'Offerte montage'!Q70,\"\"))","v":""},null,{"$f":"IF(C47=\"G\",'Offerte goederen'!Y70,IF(C47=\"M\",'Offerte montage'!S70,\"\"))","v":""}]
[{"$f":"'Offerte goederen'!B71","v":0},{"$f":"CONCATENATE(IF('Offerte goederen'!C71=0,\"\",CONCATENATE('Offerte goederen'!C71,\", \")),IF('Offerte goederen'!O71=0,\"\",CONCATENATE(\"merk: \",'Offerte goederen'!O71)),IF('Offerte goederen'!N71=0,\"\",CONCATENATE(\", omschrijving: \",'Offerte goederen'!N71)),IF('Offerte goederen'!H71=0,\"\",CONCATENATE(\", plooi: \",'Offerte goederen'!H71)),IF('Offerte goederen'!J71=0,\"\",CONCATENATE(\", railtype: \",'Offerte goederen'!J71)),IF('Offerte goederen'!K71=0,\"\",CONCATENATE(\", railkleur: \",'Offerte goederen'!K71)))","v":""},"G",{"$f":"'Offerte goederen'!P71","v":0},null,{"$f":"IF(C48=\"G\",'Offerte goederen'!R71,IF(C48=\"M\",'Offerte montage'!L71,\"\"))","v":0},{"$f":"IF(C48=\"G\",'Offerte goederen'!S71,IF(C48=\"M\",'Offerte montage'!M71,\"\"))","v":0},null,{"$f":"IF(C48=\"G\",'Offerte goederen'!U71,IF(C48=\"M\",'Offerte montage'!O71,\"\"))","v":0},null,{"$f":"IF(C48=\"G\",'Offerte goederen'!W71,IF(C48=\"M\",'Offerte montage'!Q71,\"\"))","v":""},null,{"$f":"IF(C48=\"G\",'Offerte goederen'!Y71,IF(C48=\"M\",'Offerte montage'!S71,\"\"))","v":""}]
[{"$f":"'Offerte goederen'!B72","v":0},{"$f":"CONCATENATE(IF('Offerte goederen'!C72=0,\"\",CONCATENATE('Offerte goederen'!C72,\", \")),IF('Offerte goederen'!O72=0,\"\",CONCATENATE(\"merk: \",'Offerte goederen'!O72)),IF('Offerte goederen'!N72=0,\"\",CONCATENATE(\", omschrijving: \",'Offerte goederen'!N72)),IF('Offerte goederen'!H72=0,\"\",CONCATENATE(\", plooi: \",'Offerte goederen'!H72)),IF('Offerte goederen'!J72=0,\"\",CONCATENATE(\", railtype: \",'Offerte goederen'!J72)),IF('Offerte goederen'!K72=0,\"\",CONCATENATE(\", railkleur: \",'Offerte goederen'!K72)))","v":""},"G",{"$f":"'Offerte goederen'!P72","v":0},null,{"$f":"IF(C49=\"G\",'Offerte goederen'!R72,IF(C49=\"M\",'Offerte montage'!L72,\"\"))","v":0},{"$f":"IF(C49=\"G\",'Offerte goederen'!S72,IF(C49=\"M\",'Offerte montage'!M72,\"\"))","v":0},null,{"$f":"IF(C49=\"G\",'Offerte goederen'!U72,IF(C49=\"M\",'Offerte montage'!O72,\"\"))","v":0},null,{"$f":"IF(C49=\"G\",'Offerte goederen'!W72,IF(C49=\"M\",'Offerte montage'!Q72,\"\"))","v":""},null,{"$f":"IF(C49=\"G\",'Offerte goederen'!Y72,IF(C49=\"M\",'Offerte montage'!S72,\"\"))","v":""}]
[{"$f":"'Offerte goederen'!B73","v":0},{"$f":"CONCATENATE(IF('Offerte goederen'!C73=0,\"\",CONCATENATE('Offerte goederen'!C73,\", \")),IF('Offerte goederen'!O73=0,\"\",CONCATENATE(\"merk: \",'Offerte goederen'!O73)),IF('Offerte goederen'!N73=0,\"\",CONCATENATE(\", omschrijving: \",'Offerte goederen'!N73)),IF('Offerte goederen'!H73=0,\"\",CONCATENATE(\", plooi: \",'Offerte goederen'!H73)),IF('Offerte goederen'!J73=0,\"\",CONCATENATE(\", railtype: \",'Offerte goederen'!J73)),IF('Offerte goederen'!K73=0,\"\",CONCATENATE(\", railkleur: \",'Offerte goederen'!K73)))","v":""},"G",{"$f":"'Offerte goederen'!P73","v":0},null,{"$f":"IF(C50=\"G\",'Offerte goederen'!R73,IF(C50=\"M\",'Offerte montage'!L73,\"\"))","v":0},{"$f":"IF(C50=\"G\",'Offerte goederen'!S73,IF(C50=\"M\",'Offerte montage'!M73,\"\"))","v":0},null,{"$f":"IF(C50=\"G\",'Offerte goederen'!U73,IF(C50=\"M\",'Offerte montage'!O73,\"\"))","v":0},null,{"$f":"IF(C50=\"G\",'Offerte goederen'!W73,IF(C50=\"M\",'Offerte montage'!Q73,\"\"))","v":""},null,{"$f":"IF(C50=\"G\",'Offerte goederen'!Y73,IF(C50=\"M\",'Offerte montage'!S73,\"\"))","v":""}]
[{"$f":"'Offerte goederen'!B74","v":0},{"$f":"CONCATENATE(IF('Offerte goederen'!C74=0,\"\",CONCATENATE('Offerte goederen'!C74,\", \")),IF('Offerte goederen'!O74=0,\"\",CONCATENATE(\"merk: \",'Offerte goederen'!O74)),IF('Offerte goederen'!N74=0,\"\",CONCATENATE(\", omschrijving: \",'Offerte goederen'!N74)),IF('Offerte goederen'!H74=0,\"\",CONCATENATE(\", plooi: \",'Offerte goederen'!H74)),IF('Offerte goederen'!J74=0,\"\",CONCATENATE(\", railtype: \",'Offerte goederen'!J74)),IF('Offerte goederen'!K74=0,\"\",CONCATENATE(\", railkleur: \",'Offerte goederen'!K74)))","v":""},"G",{"$f":"'Offerte goederen'!P74","v":0},null,{"$f":"IF(C51=\"G\",'Offerte goederen'!R74,IF(C51=\"M\",'Offerte montage'!L74,\"\"))","v":0},{"$f":"IF(C51=\"G\",'Offerte goederen'!S74,IF(C51=\"M\",'Offerte montage'!M74,\"\"))","v":0},null,{"$f":"IF(C51=\"G\",'Offerte goederen'!U74,IF(C51=\"M\",'Offerte montage'!O74,\"\"))","v":0},null,{"$f":"IF(C51=\"G\",'Offerte goederen'!W74,IF(C51=\"M\",'Offerte montage'!Q74,\"\"))","v":""},null,{"$f":"IF(C51=\"G\",'Offerte goederen'!Y74,IF(C51=\"M\",'Offerte montage'!S74,\"\"))","v":""}]
[{"$f":"'Offerte goederen'!B75","v":0},{"$f":"CONCATENATE(IF('Offerte goederen'!C75=0,\"\",CONCATENATE('Offerte goederen'!C75,\", \")),IF('Offerte goederen'!O75=0,\"\",CONCATENATE(\"merk: \",'Offerte goederen'!O75)),IF('Offerte goederen'!N75=0,\"\",CONCATENATE(\", omschrijving: \",'Offerte goederen'!N75)),IF('Offerte goederen'!H75=0,\"\",CONCATENATE(\", plooi: \",'Offerte goederen'!H75)),IF('Offerte goederen'!J75=0,\"\",CONCATENATE(\", railtype: \",'Offerte goederen'!J75)),IF('Offerte goederen'!K75=0,\"\",CONCATENATE(\", railkleur: \",'Offerte goederen'!K75)))","v":""},"G",{"$f":"'Offerte goederen'!P75","v":0},null,{"$f":"IF(C52=\"G\",'Offerte goederen'!R75,IF(C52=\"M\",'Offerte montage'!L75,\"\"))","v":0},{"$f":"IF(C52=\"G\",'Offerte goederen'!S75,IF(C52=\"M\",'Offerte montage'!M75,\"\"))","v":0},null,{"$f":"IF(C52=\"G\",'Offerte goederen'!U75,IF(C52=\"M\",'Offerte montage'!O75,\"\"))","v":0},null,{"$f":"IF(C52=\"G\",'Offerte goederen'!W75,IF(C52=\"M\",'Offerte montage'!Q75,\"\"))","v":""},null,{"$f":"IF(C52=\"G\",'Offerte goederen'!Y75,IF(C52=\"M\",'Offerte montage'!S75,\"\"))","v":""}]
[{"$f":"'Offerte goederen'!B76","v":0},{"$f":"CONCATENATE(IF('Offerte goederen'!C76=0,\"\",CONCATENATE('Offerte goederen'!C76,\", \")),IF('Offerte goederen'!O76=0,\"\",CONCATENATE(\"merk: \",'Offerte goederen'!O76)),IF('Offerte goederen'!N76=0,\"\",CONCATENATE(\", omschrijving: \",'Offerte goederen'!N76)),IF('Offerte goederen'!H76=0,\"\",CONCATENATE(\", plooi: \",'Offerte goederen'!H76)),IF('Offerte goederen'!J76=0,\"\",CONCATENATE(\", railtype: \",'Offerte goederen'!J76)),IF('Offerte goederen'!K76=0,\"\",CONCATENATE(\", railkleur: \",'Offerte goederen'!K76)))","v":""},"G",{"$f":"'Offerte goederen'!P76","v":0},null,{"$f":"IF(C53=\"G\",'Offerte goederen'!R76,IF(C53=\"M\",'Offerte montage'!L76,\"\"))","v":0},{"$f":"IF(C53=\"G\",'Offerte goederen'!S76,IF(C53=\"M\",'Offerte montage'!M76,\"\"))","v":0},null,{"$f":"IF(C53=\"G\",'Offerte goederen'!U76,IF(C53=\"M\",'Offerte montage'!O76,\"\"))","v":0},null,{"$f":"IF(C53=\"G\",'Offerte goederen'!W76,IF(C53=\"M\",'Offerte montage'!Q76,\"\"))","v":""},null,{"$f":"IF(C53=\"G\",'Offerte goederen'!Y76,IF(C53=\"M\",'Offerte montage'!S76,\"\"))","v":""}]
[{"$f":"'Offerte goederen'!B77","v":0},{"$f":"CONCATENATE(IF('Offerte goederen'!C77=0,\"\",CONCATENATE('Offerte goederen'!C77,\", \")),IF('Offerte goederen'!O77=0,\"\",CONCATENATE(\"merk: \",'Offerte goederen'!O77)),IF('Offerte goederen'!N77=0,\"\",CONCATENATE(\", omschrijving: \",'Offerte goederen'!N77)),IF('Offerte goederen'!H77=0,\"\",CONCATENATE(\", plooi: \",'Offerte goederen'!H77)),IF('Offerte goederen'!J77=0,\"\",CONCATENATE(\", railtype: \",'Offerte goederen'!J77)),IF('Offerte goederen'!K77=0,\"\",CONCATENATE(\", railkleur: \",'Offerte goederen'!K77)))","v":""},"G",{"$f":"'Offerte goederen'!P77","v":0},null,{"$f":"IF(C54=\"G\",'Offerte goederen'!R77,IF(C54=\"M\",'Offerte montage'!L77,\"\"))","v":0},{"$f":"IF(C54=\"G\",'Offerte goederen'!S77,IF(C54=\"M\",'Offerte montage'!M77,\"\"))","v":0},null,{"$f":"IF(C54=\"G\",'Offerte goederen'!U77,IF(C54=\"M\",'Offerte montage'!O77,\"\"))","v":0},null,{"$f":"IF(C54=\"G\",'Offerte goederen'!W77,IF(C54=\"M\",'Offerte montage'!Q77,\"\"))","v":""},null,{"$f":"IF(C54=\"G\",'Offerte goederen'!Y77,IF(C54=\"M\",'Offerte montage'!S77,\"\"))","v":""}]
[{"$f":"'Offerte goederen'!B78","v":0},{"$f":"CONCATENATE(IF('Offerte goederen'!C78=0,\"\",CONCATENATE('Offerte goederen'!C78,\", \")),IF('Offerte goederen'!O78=0,\"\",CONCATENATE(\"merk: \",'Offerte goederen'!O78)),IF('Offerte goederen'!N78=0,\"\",CONCATENATE(\", omschrijving: \",'Offerte goederen'!N78)),IF('Offerte goederen'!H78=0,\"\",CONCATENATE(\", plooi: \",'Offerte goederen'!H78)),IF('Offerte goederen'!J78=0,\"\",CONCATENATE(\", railtype: \",'Offerte goederen'!J78)),IF('Offerte goederen'!K78=0,\"\",CONCATENATE(\", railkleur: \",'Offerte goederen'!K78)))","v":""},"G",{"$f":"'Offerte goederen'!P78","v":0},null,{"$f":"IF(C55=\"G\",'Offerte goederen'!R78,IF(C55=\"M\",'Offerte montage'!L78,\"\"))","v":0},{"$f":"IF(C55=\"G\",'Offerte goederen'!S78,IF(C55=\"M\",'Offerte montage'!M78,\"\"))","v":0},null,{"$f":"IF(C55=\"G\",'Offerte goederen'!U78,IF(C55=\"M\",'Offerte montage'!O78,\"\"))","v":0},null,{"$f":"IF(C55=\"G\",'Offerte goederen'!W78,IF(C55=\"M\",'Offerte montage'!Q78,\"\"))","v":""},null,{"$f":"IF(C55=\"G\",'Offerte goederen'!Y78,IF(C55=\"M\",'Offerte montage'!S78,\"\"))","v":""}]
[{"$f":"'Offerte goederen'!B79","v":0},{"$f":"CONCATENATE(IF('Offerte goederen'!C79=0,\"\",CONCATENATE('Offerte goederen'!C79,\", \")),IF('Offerte goederen'!O79=0,\"\",CONCATENATE(\"merk: \",'Offerte goederen'!O79)),IF('Offerte goederen'!N79=0,\"\",CONCATENATE(\", omschrijving: \",'Offerte goederen'!N79)),IF('Offerte goederen'!H79=0,\"\",CONCATENATE(\", plooi: \",'Offerte goederen'!H79)),IF('Offerte goederen'!J79=0,\"\",CONCATENATE(\", railtype: \",'Offerte goederen'!J79)),IF('Offerte goederen'!K79=0,\"\",CONCATENATE(\", railkleur: \",'Offerte goederen'!K79)))","v":""},"G",{"$f":"'Offerte goederen'!P79","v":0},null,{"$f":"IF(C56=\"G\",'Offerte goederen'!R79,IF(C56=\"M\",'Offerte montage'!L79,\"\"))","v":0},{"$f":"IF(C56=\"G\",'Offerte goederen'!S79,IF(C56=\"M\",'Offerte montage'!M79,\"\"))","v":0},null,{"$f":"IF(C56=\"G\",'Offerte goederen'!U79,IF(C56=\"M\",'Offerte montage'!O79,\"\"))","v":0},null,{"$f":"IF(C56=\"G\",'Offerte goederen'!W79,IF(C56=\"M\",'Offerte montage'!Q79,\"\"))","v":""},null,{"$f":"IF(C56=\"G\",'Offerte goederen'!Y79,IF(C56=\"M\",'Offerte montage'!S79,\"\"))","v":""}]
[{"$f":"'Offerte goederen'!B80","v":0},{"$f":"CONCATENATE(IF('Offerte goederen'!C80=0,\"\",CONCATENATE('Offerte goederen'!C80,\", \")),IF('Offerte goederen'!O80=0,\"\",CONCATENATE(\"merk: \",'Offerte goederen'!O80)),IF('Offerte goederen'!N80=0,\"\",CONCATENATE(\", omschrijving: \",'Offerte goederen'!N80)),IF('Offerte goederen'!H80=0,\"\",CONCATENATE(\", plooi: \",'Offerte goederen'!H80)),IF('Offerte goederen'!J80=0,\"\",CONCATENATE(\", railtype: \",'Offerte goederen'!J80)),IF('Offerte goederen'!K80=0,\"\",CONCATENATE(\", railkleur: \",'Offerte goederen'!K80)))","v":""},"G",{"$f":"'Offerte goederen'!P80","v":0},null,{"$f":"IF(C57=\"G\",'Offerte goederen'!R80,IF(C57=\"M\",'Offerte montage'!L80,\"\"))","v":0},{"$f":"IF(C57=\"G\",'Offerte goederen'!S80,IF(C57=\"M\",'Offerte montage'!M80,\"\"))","v":0},null,{"$f":"IF(C57=\"G\",'Offerte goederen'!U80,IF(C57=\"M\",'Offerte montage'!O80,\"\"))","v":0},null,{"$f":"IF(C57=\"G\",'Offerte goederen'!W80,IF(C57=\"M\",'Offerte montage'!Q80,\"\"))","v":""},null,{"$f":"IF(C57=\"G\",'Offerte goederen'!Y80,IF(C57=\"M\",'Offerte montage'!S80,\"\"))","v":""}]
[{"$f":"'Offerte goederen'!B81","v":0},{"$f":"CONCATENATE(IF('Offerte goederen'!C81=0,\"\",CONCATENATE('Offerte goederen'!C81,\", \")),IF('Offerte goederen'!O81=0,\"\",CONCATENATE(\"merk: \",'Offerte goederen'!O81)),IF('Offerte goederen'!N81=0,\"\",CONCATENATE(\", omschrijving: \",'Offerte goederen'!N81)),IF('Offerte goederen'!H81=0,\"\",CONCATENATE(\", plooi: \",'Offerte goederen'!H81)),IF('Offerte goederen'!J81=0,\"\",CONCATENATE(\", railtype: \",'Offerte goederen'!J81)),IF('Offerte goederen'!K81=0,\"\",CONCATENATE(\", railkleur: \",'Offerte goederen'!K81)))","v":""},"G",{"$f":"'Offerte goederen'!P81","v":0},null,{"$f":"IF(C58=\"G\",'Offerte goederen'!R81,IF(C58=\"M\",'Offerte montage'!L81,\"\"))","v":0},{"$f":"IF(C58=\"G\",'Offerte goederen'!S81,IF(C58=\"M\",'Offerte montage'!M81,\"\"))","v":0},null,{"$f":"IF(C58=\"G\",'Offerte goederen'!U81,IF(C58=\"M\",'Offerte montage'!O81,\"\"))","v":0},null,{"$f":"IF(C58=\"G\",'Offerte goederen'!W81,IF(C58=\"M\",'Offerte montage'!Q81,\"\"))","v":""},null,{"$f":"IF(C58=\"G\",'Offerte goederen'!Y81,IF(C58=\"M\",'Offerte montage'!S81,\"\"))","v":""}]
[{"$f":"'Offerte goederen'!B82","v":0},{"$f":"CONCATENATE(IF('Offerte goederen'!C82=0,\"\",CONCATENATE('Offerte goederen'!C82,\", \")),IF('Offerte goederen'!O82=0,\"\",CONCATENATE(\"merk: \",'Offerte goederen'!O82)),IF('Offerte goederen'!N82=0,\"\",CONCATENATE(\", omschrijving: \",'Offerte goederen'!N82)),IF('Offerte goederen'!H82=0,\"\",CONCATENATE(\", plooi: \",'Offerte goederen'!H82)),IF('Offerte goederen'!J82=0,\"\",CONCATENATE(\", railtype: \",'Offerte goederen'!J82)),IF('Offerte goederen'!K82=0,\"\",CONCATENATE(\", railkleur: \",'Offerte goederen'!K82)))","v":""},"G",{"$f":"'Offerte goederen'!P82","v":0},null,{"$f":"IF(C59=\"G\",'Offerte goederen'!R82,IF(C59=\"M\",'Offerte montage'!L82,\"\"))","v":0},{"$f":"IF(C59=\"G\",'Offerte goederen'!S82,IF(C59=\"M\",'Offerte montage'!M82,\"\"))","v":0},null,{"$f":"IF(C59=\"G\",'Offerte goederen'!U82,IF(C59=\"M\",'Offerte montage'!O82,\"\"))","v":0},null,{"$f":"IF(C59=\"G\",'Offerte goederen'!W82,IF(C59=\"M\",'Offerte montage'!Q82,\"\"))","v":""},null,{"$f":"IF(C59=\"G\",'Offerte goederen'!Y82,IF(C59=\"M\",'Offerte montage'!S82,\"\"))","v":""}]
[{"$f":"'Offerte goederen'!B83","v":0},{"$f":"CONCATENATE(IF('Offerte goederen'!C83=0,\"\",CONCATENATE('Offerte goederen'!C83,\", \")),IF('Offerte goederen'!O83=0,\"\",CONCATENATE(\"merk: \",'Offerte goederen'!O83)),IF('Offerte goederen'!N83=0,\"\",CONCATENATE(\", omschrijving: \",'Offerte goederen'!N83)),IF('Offerte goederen'!H83=0,\"\",CONCATENATE(\", plooi: \",'Offerte goederen'!H83)),IF('Offerte goederen'!J83=0,\"\",CONCATENATE(\", railtype: \",'Offerte goederen'!J83)),IF('Offerte goederen'!K83=0,\"\",CONCATENATE(\", railkleur: \",'Offerte goederen'!K83)))","v":""},"G",{"$f":"'Offerte goederen'!P83","v":0},null,{"$f":"IF(C60=\"G\",'Offerte goederen'!R83,IF(C60=\"M\",'Offerte montage'!L83,\"\"))","v":0},{"$f":"IF(C60=\"G\",'Offerte goederen'!S83,IF(C60=\"M\",'Offerte montage'!M83,\"\"))","v":0},null,{"$f":"IF(C60=\"G\",'Offerte goederen'!U83,IF(C60=\"M\",'Offerte montage'!O83,\"\"))","v":0},null,{"$f":"IF(C60=\"G\",'Offerte goederen'!W83,IF(C60=\"M\",'Offerte montage'!Q83,\"\"))","v":""},null,{"$f":"IF(C60=\"G\",'Offerte goederen'!Y83,IF(C60=\"M\",'Offerte montage'!S83,\"\"))","v":""}]
[{"$f":"'Offerte goederen'!B84","v":0},{"$f":"CONCATENATE(IF('Offerte goederen'!C84=0,\"\",CONCATENATE('Offerte goederen'!C84,\", \")),IF('Offerte goederen'!O84=0,\"\",CONCATENATE(\"merk: \",'Offerte goederen'!O84)),IF('Offerte goederen'!N84=0,\"\",CONCATENATE(\", omschrijving: \",'Offerte goederen'!N84)),IF('Offerte goederen'!H84=0,\"\",CONCATENATE(\", plooi: \",'Offerte goederen'!H84)),IF('Offerte goederen'!J84=0,\"\",CONCATENATE(\", railtype: \",'Offerte goederen'!J84)),IF('Offerte goederen'!K84=0,\"\",CONCATENATE(\", railkleur: \",'Offerte goederen'!K84)))","v":""},"G",{"$f":"'Offerte goederen'!P84","v":0},null,{"$f":"IF(C61=\"G\",'Offerte goederen'!R84,IF(C61=\"M\",'Offerte montage'!L84,\"\"))","v":0},{"$f":"IF(C61=\"G\",'Offerte goederen'!S84,IF(C61=\"M\",'Offerte montage'!M84,\"\"))","v":0},null,{"$f":"IF(C61=\"G\",'Offerte goederen'!U84,IF(C61=\"M\",'Offerte montage'!O84,\"\"))","v":0},null,{"$f":"IF(C61=\"G\",'Offerte goederen'!W84,IF(C61=\"M\",'Offerte montage'!Q84,\"\"))","v":""},null,{"$f":"IF(C61=\"G\",'Offerte goederen'!Y84,IF(C61=\"M\",'Offerte montage'!S84,\"\"))","v":""}]
[{"$f":"'Offerte goederen'!B85","v":0},{"$f":"CONCATENATE(IF('Offerte goederen'!C85=0,\"\",CONCATENATE('Offerte goederen'!C85,\", \")),IF('Offerte goederen'!O85=0,\"\",CONCATENATE(\"merk: \",'Offerte goederen'!O85)),IF('Offerte goederen'!N85=0,\"\",CONCATENATE(\", omschrijving: \",'Offerte goederen'!N85)),IF('Offerte goederen'!H85=0,\"\",CONCATENATE(\", plooi: \",'Offerte goederen'!H85)),IF('Offerte goederen'!J85=0,\"\",CONCATENATE(\", railtype: \",'Offerte goederen'!J85)),IF('Offerte goederen'!K85=0,\"\",CONCATENATE(\", railkleur: \",'Offerte goederen'!K85)))","v":""},"G",{"$f":"'Offerte goederen'!P85","v":0},null,{"$f":"IF(C62=\"G\",'Offerte goederen'!R85,IF(C62=\"M\",'Offerte montage'!L85,\"\"))","v":0},{"$f":"IF(C62=\"G\",'Offerte goederen'!S85,IF(C62=\"M\",'Offerte montage'!M85,\"\"))","v":0},null,{"$f":"IF(C62=\"G\",'Offerte goederen'!U85,IF(C62=\"M\",'Offerte montage'!O85,\"\"))","v":0},null,{"$f":"IF(C62=\"G\",'Offerte goederen'!W85,IF(C62=\"M\",'Offerte montage'!Q85,\"\"))","v":""},null,{"$f":"IF(C62=\"G\",'Offerte goederen'!Y85,IF(C62=\"M\",'Offerte montage'!S85,\"\"))","v":""}]
[{"$f":"'Offerte goederen'!B86","v":0},{"$f":"CONCATENATE(IF('Offerte goederen'!C86=0,\"\",CONCATENATE('Offerte goederen'!C86,\", \")),IF('Offerte goederen'!O86=0,\"\",CONCATENATE(\"merk: \",'Offerte goederen'!O86)),IF('Offerte goederen'!N86=0,\"\",CONCATENATE(\", omschrijving: \",'Offerte goederen'!N86)),IF('Offerte goederen'!H86=0,\"\",CONCATENATE(\", plooi: \",'Offerte goederen'!H86)),IF('Offerte goederen'!J86=0,\"\",CONCATENATE(\", railtype: \",'Offerte goederen'!J86)),IF('Offerte goederen'!K86=0,\"\",CONCATENATE(\", railkleur: \",'Offerte goederen'!K86)))","v":""},"G",{"$f":"'Offerte goederen'!P86","v":0},null,{"$f":"IF(C63=\"G\",'Offerte goederen'!R86,IF(C63=\"M\",'Offerte montage'!L86,\"\"))","v":0},{"$f":"IF(C63=\"G\",'Offerte goederen'!S86,IF(C63=\"M\",'Offerte montage'!M86,\"\"))","v":0},null,{"$f":"IF(C63=\"G\",'Offerte goederen'!U86,IF(C63=\"M\",'Offerte montage'!O86,\"\"))","v":0},null,{"$f":"IF(C63=\"G\",'Offerte goederen'!W86,IF(C63=\"M\",'Offerte montage'!Q86,\"\"))","v":""},null,{"$f":"IF(C63=\"G\",'Offerte goederen'!Y86,IF(C63=\"M\",'Offerte montage'!S86,\"\"))","v":""}]
[{"$f":"'Offerte goederen'!B87","v":0},{"$f":"CONCATENATE(IF('Offerte goederen'!C87=0,\"\",CONCATENATE('Offerte goederen'!C87,\", \")),IF('Offerte goederen'!O87=0,\"\",CONCATENATE(\"merk: \",'Offerte goederen'!O87)),IF('Offerte goederen'!N87=0,\"\",CONCATENATE(\", omschrijving: \",'Offerte goederen'!N87)),IF('Offerte goederen'!H87=0,\"\",CONCATENATE(\", plooi: \",'Offerte goederen'!H87)),IF('Offerte goederen'!J87=0,\"\",CONCATENATE(\", railtype: \",'Offerte goederen'!J87)),IF('Offerte goederen'!K87=0,\"\",CONCATENATE(\", railkleur: \",'Offerte goederen'!K87)))","v":""},"G",{"$f":"'Offerte goederen'!P87","v":0},null,{"$f":"IF(C64=\"G\",'Offerte goederen'!R87,IF(C64=\"M\",'Offerte montage'!L87,\"\"))","v":0},{"$f":"IF(C64=\"G\",'Offerte goederen'!S87,IF(C64=\"M\",'Offerte montage'!M87,\"\"))","v":0},null,{"$f":"IF(C64=\"G\",'Offerte goederen'!U87,IF(C64=\"M\",'Offerte montage'!O87,\"\"))","v":0},null,{"$f":"IF(C64=\"G\",'Offerte goederen'!W87,IF(C64=\"M\",'Offerte montage'!Q87,\"\"))","v":""},null,{"$f":"IF(C64=\"G\",'Offerte goederen'!Y87,IF(C64=\"M\",'Offerte montage'!S87,\"\"))","v":""}]
[{"$f":"'Offerte goederen'!B88","v":0},{"$f":"CONCATENATE(IF('Offerte goederen'!C88=0,\"\",CONCATENATE('Offerte goederen'!C88,\", \")),IF('Offerte goederen'!O88=0,\"\",CONCATENATE(\"merk: \",'Offerte goederen'!O88)),IF('Offerte goederen'!N88=0,\"\",CONCATENATE(\", omschrijving: \",'Offerte goederen'!N88)),IF('Offerte goederen'!H88=0,\"\",CONCATENATE(\", plooi: \",'Offerte goederen'!H88)),IF('Offerte goederen'!J88=0,\"\",CONCATENATE(\", railtype: \",'Offerte goederen'!J88)),IF('Offerte goederen'!K88=0,\"\",CONCATENATE(\", railkleur: \",'Offerte goederen'!K88)))","v":""},"G",{"$f":"'Offerte goederen'!P88","v":0},null,{"$f":"IF(C65=\"G\",'Offerte goederen'!R88,IF(C65=\"M\",'Offerte montage'!L88,\"\"))","v":0},{"$f":"IF(C65=\"G\",'Offerte goederen'!S88,IF(C65=\"M\",'Offerte montage'!M88,\"\"))","v":0},null,{"$f":"IF(C65=\"G\",'Offerte goederen'!U88,IF(C65=\"M\",'Offerte montage'!O88,\"\"))","v":0},null,{"$f":"IF(C65=\"G\",'Offerte goederen'!W88,IF(C65=\"M\",'Offerte montage'!Q88,\"\"))","v":""},null,{"$f":"IF(C65=\"G\",'Offerte goederen'!Y88,IF(C65=\"M\",'Offerte montage'!S88,\"\"))","v":""}]
[{"$f":"'Offerte goederen'!B89","v":0},{"$f":"CONCATENATE(IF('Offerte goederen'!C89=0,\"\",CONCATENATE('Offerte goederen'!C89,\", \")),IF('Offerte goederen'!O89=0,\"\",CONCATENATE(\"merk: \",'Offerte goederen'!O89)),IF('Offerte goederen'!N89=0,\"\",CONCATENATE(\", omschrijving: \",'Offerte goederen'!N89)),IF('Offerte goederen'!H89=0,\"\",CONCATENATE(\", plooi: \",'Offerte goederen'!H89)),IF('Offerte goederen'!J89=0,\"\",CONCATENATE(\", railtype: \",'Offerte goederen'!J89)),IF('Offerte goederen'!K89=0,\"\",CONCATENATE(\", railkleur: \",'Offerte goederen'!K89)))","v":""},"G",{"$f":"'Offerte goederen'!P89","v":0},null,{"$f":"IF(C66=\"G\",'Offerte goederen'!R89,IF(C66=\"M\",'Offerte montage'!L89,\"\"))","v":0},{"$f":"IF(C66=\"G\",'Offerte goederen'!S89,IF(C66=\"M\",'Offerte montage'!M89,\"\"))","v":0},null,{"$f":"IF(C66=\"G\",'Offerte goederen'!U89,IF(C66=\"M\",'Offerte montage'!O89,\"\"))","v":0},null,{"$f":"IF(C66=\"G\",'Offerte goederen'!W89,IF(C66=\"M\",'Offerte montage'!Q89,\"\"))","v":""},null,{"$f":"IF(C66=\"G\",'Offerte goederen'!Y89,IF(C66=\"M\",'Offerte montage'!S89,\"\"))","v":""}]
[{"$f":"'Offerte goederen'!B90","v":0},{"$f":"CONCATENATE(IF('Offerte goederen'!C90=0,\"\",CONCATENATE('Offerte goederen'!C90,\", \")),IF('Offerte goederen'!O90=0,\"\",CONCATENATE(\"merk: \",'Offerte goederen'!O90)),IF('Offerte goederen'!N90=0,\"\",CONCATENATE(\", omschrijving: \",'Offerte goederen'!N90)),IF('Offerte goederen'!H90=0,\"\",CONCATENATE(\", plooi: \",'Offerte goederen'!H90)),IF('Offerte goederen'!J90=0,\"\",CONCATENATE(\", railtype: \",'Offerte goederen'!J90)),IF('Offerte goederen'!K90=0,\"\",CONCATENATE(\", railkleur: \",'Offerte goederen'!K90)))","v":""},"G",{"$f":"'Offerte goederen'!P90","v":0},null,{"$f":"IF(C67=\"G\",'Offerte goederen'!R90,IF(C67=\"M\",'Offerte montage'!L90,\"\"))","v":0},{"$f":"IF(C67=\"G\",'Offerte goederen'!S90,IF(C67=\"M\",'Offerte montage'!M90,\"\"))","v":0},null,{"$f":"IF(C67=\"G\",'Offerte goederen'!U90,IF(C67=\"M\",'Offerte montage'!O90,\"\"))","v":0},null,{"$f":"IF(C67=\"G\",'Offerte goederen'!W90,IF(C67=\"M\",'Offerte montage'!Q90,\"\"))","v":""},null,{"$f":"IF(C67=\"G\",'Offerte goederen'!Y90,IF(C67=\"M\",'Offerte montage'!S90,\"\"))","v":""}]
[{"$f":"'Offerte goederen'!B91","v":0},{"$f":"CONCATENATE(IF('Offerte goederen'!C91=0,\"\",CONCATENATE('Offerte goederen'!C91,\", \")),IF('Offerte goederen'!O91=0,\"\",CONCATENATE(\"merk: \",'Offerte goederen'!O91)),IF('Offerte goederen'!N91=0,\"\",CONCATENATE(\", omschrijving: \",'Offerte goederen'!N91)),IF('Offerte goederen'!H91=0,\"\",CONCATENATE(\", plooi: \",'Offerte goederen'!H91)),IF('Offerte goederen'!J91=0,\"\",CONCATENATE(\", railtype: \",'Offerte goederen'!J91)),IF('Offerte goederen'!K91=0,\"\",CONCATENATE(\", railkleur: \",'Offerte goederen'!K91)))","v":""},"G",{"$f":"'Offerte goederen'!P91","v":0},null,{"$f":"IF(C68=\"G\",'Offerte goederen'!R91,IF(C68=\"M\",'Offerte montage'!L91,\"\"))","v":0},{"$f":"IF(C68=\"G\",'Offerte goederen'!S91,IF(C68=\"M\",'Offerte montage'!M91,\"\"))","v":0},null,{"$f":"IF(C68=\"G\",'Offerte goederen'!U91,IF(C68=\"M\",'Offerte montage'!O91,\"\"))","v":0},null,{"$f":"IF(C68=\"G\",'Offerte goederen'!W91,IF(C68=\"M\",'Offerte montage'!Q91,\"\"))","v":""},null,{"$f":"IF(C68=\"G\",'Offerte goederen'!Y91,IF(C68=\"M\",'Offerte montage'!S91,\"\"))","v":""}]
[{"$f":"'Offerte goederen'!B92","v":0},{"$f":"CONCATENATE(IF('Offerte goederen'!C92=0,\"\",CONCATENATE('Offerte goederen'!C92,\", \")),IF('Offerte goederen'!O92=0,\"\",CONCATENATE(\"merk: \",'Offerte goederen'!O92)),IF('Offerte goederen'!N92=0,\"\",CONCATENATE(\", omschrijving: \",'Offerte goederen'!N92)),IF('Offerte goederen'!H92=0,\"\",CONCATENATE(\", plooi: \",'Offerte goederen'!H92)),IF('Offerte goederen'!J92=0,\"\",CONCATENATE(\", railtype: \",'Offerte goederen'!J92)),IF('Offerte goederen'!K92=0,\"\",CONCATENATE(\", railkleur: \",'Offerte goederen'!K92)))","v":""},"G",{"$f":"'Offerte goederen'!P92","v":0},null,{"$f":"IF(C69=\"G\",'Offerte goederen'!R92,IF(C69=\"M\",'Offerte montage'!L92,\"\"))","v":0},{"$f":"IF(C69=\"G\",'Offerte goederen'!S92,IF(C69=\"M\",'Offerte montage'!M92,\"\"))","v":0},null,{"$f":"IF(C69=\"G\",'Offerte goederen'!U92,IF(C69=\"M\",'Offerte montage'!O92,\"\"))","v":0},null,{"$f":"IF(C69=\"G\",'Offerte goederen'!W92,IF(C69=\"M\",'Offerte montage'!Q92,\"\"))","v":""},null,{"$f":"IF(C69=\"G\",'Offerte goederen'!Y92,IF(C69=\"M\",'Offerte montage'!S92,\"\"))","v":""}]
[{"$f":"'Offerte goederen'!B93","v":0},{"$f":"CONCATENATE(IF('Offerte goederen'!C93=0,\"\",CONCATENATE('Offerte goederen'!C93,\", \")),IF('Offerte goederen'!O93=0,\"\",CONCATENATE(\"merk: \",'Offerte goederen'!O93)),IF('Offerte goederen'!N93=0,\"\",CONCATENATE(\", omschrijving: \",'Offerte goederen'!N93)),IF('Offerte goederen'!H93=0,\"\",CONCATENATE(\", plooi: \",'Offerte goederen'!H93)),IF('Offerte goederen'!J93=0,\"\",CONCATENATE(\", railtype: \",'Offerte goederen'!J93)),IF('Offerte goederen'!K93=0,\"\",CONCATENATE(\", railkleur: \",'Offerte goederen'!K93)))","v":""},"G",{"$f":"'Offerte goederen'!P93","v":0},null,{"$f":"IF(C70=\"G\",'Offerte goederen'!R93,IF(C70=\"M\",'Offerte montage'!L93,\"\"))","v":0},{"$f":"IF(C70=\"G\",'Offerte goederen'!S93,IF(C70=\"M\",'Offerte montage'!M93,\"\"))","v":0},null,{"$f":"IF(C70=\"G\",'Offerte goederen'!U93,IF(C70=\"M\",'Offerte montage'!O93,\"\"))","v":0},null,{"$f":"IF(C70=\"G\",'Offerte goederen'!W93,IF(C70=\"M\",'Offerte montage'!Q93,\"\"))","v":""},null,{"$f":"IF(C70=\"G\",'Offerte goederen'!Y93,IF(C70=\"M\",'Offerte montage'!S93,\"\"))","v":""}]
[{"$f":"'Offerte goederen'!B94","v":0},{"$f":"CONCATENATE(IF('Offerte goederen'!C94=0,\"\",CONCATENATE('Offerte goederen'!C94,\", \")),IF('Offerte goederen'!O94=0,\"\",CONCATENATE(\"merk: \",'Offerte goederen'!O94)),IF('Offerte goederen'!N94=0,\"\",CONCATENATE(\", omschrijving: \",'Offerte goederen'!N94)),IF('Offerte goederen'!H94=0,\"\",CONCATENATE(\", plooi: \",'Offerte goederen'!H94)),IF('Offerte goederen'!J94=0,\"\",CONCATENATE(\", railtype: \",'Offerte goederen'!J94)),IF('Offerte goederen'!K94=0,\"\",CONCATENATE(\", railkleur: \",'Offerte goederen'!K94)))","v":""},"G",{"$f":"'Offerte goederen'!P94","v":0},null,{"$f":"IF(C71=\"G\",'Offerte goederen'!R94,IF(C71=\"M\",'Offerte montage'!L94,\"\"))","v":0},{"$f":"IF(C71=\"G\",'Offerte goederen'!S94,IF(C71=\"M\",'Offerte montage'!M94,\"\"))","v":0},null,{"$f":"IF(C71=\"G\",'Offerte goederen'!U94,IF(C71=\"M\",'Offerte montage'!O94,\"\"))","v":0},null,{"$f":"IF(C71=\"G\",'Offerte goederen'!W94,IF(C71=\"M\",'Offerte montage'!Q94,\"\"))","v":""},null,{"$f":"IF(C71=\"G\",'Offerte goederen'!Y94,IF(C71=\"M\",'Offerte montage'!S94,\"\"))","v":""}]
[{"$f":"'Offerte goederen'!B95","v":0},{"$f":"CONCATENATE(IF('Offerte goederen'!C95=0,\"\",CONCATENATE('Offerte goederen'!C95,\", \")),IF('Offerte goederen'!O95=0,\"\",CONCATENATE(\"merk: \",'Offerte goederen'!O95)),IF('Offerte goederen'!N95=0,\"\",CONCATENATE(\", omschrijving: \",'Offerte goederen'!N95)),IF('Offerte goederen'!H95=0,\"\",CONCATENATE(\", plooi: \",'Offerte goederen'!H95)),IF('Offerte goederen'!J95=0,\"\",CONCATENATE(\", railtype: \",'Offerte goederen'!J95)),IF('Offerte goederen'!K95=0,\"\",CONCATENATE(\", railkleur: \",'Offerte goederen'!K95)))","v":""},"G",{"$f":"'Offerte goederen'!P95","v":0},null,{"$f":"IF(C72=\"G\",'Offerte goederen'!R95,IF(C72=\"M\",'Offerte montage'!L95,\"\"))","v":0},{"$f":"IF(C72=\"G\",'Offerte goederen'!S95,IF(C72=\"M\",'Offerte montage'!M95,\"\"))","v":0},null,{"$f":"IF(C72=\"G\",'Offerte goederen'!U95,IF(C72=\"M\",'Offerte montage'!O95,\"\"))","v":0},null,{"$f":"IF(C72=\"G\",'Offerte goederen'!W95,IF(C72=\"M\",'Offerte montage'!Q95,\"\"))","v":""},null,{"$f":"IF(C72=\"G\",'Offerte goederen'!Y95,IF(C72=\"M\",'Offerte montage'!S95,\"\"))","v":""}]
[{"$f":"'Offerte goederen'!B96","v":0},{"$f":"CONCATENATE(IF('Offerte goederen'!C96=0,\"\",CONCATENATE('Offerte goederen'!C96,\", \")),IF('Offerte goederen'!O96=0,\"\",CONCATENATE(\"merk: \",'Offerte goederen'!O96)),IF('Offerte goederen'!N96=0,\"\",CONCATENATE(\", omschrijving: \",'Offerte goederen'!N96)),IF('Offerte goederen'!H96=0,\"\",CONCATENATE(\", plooi: \",'Offerte goederen'!H96)),IF('Offerte goederen'!J96=0,\"\",CONCATENATE(\", railtype: \",'Offerte goederen'!J96)),IF('Offerte goederen'!K96=0,\"\",CONCATENATE(\", railkleur: \",'Offerte goederen'!K96)))","v":""},"G",{"$f":"'Offerte goederen'!P96","v":0},null,{"$f":"IF(C73=\"G\",'Offerte goederen'!R96,IF(C73=\"M\",'Offerte montage'!L96,\"\"))","v":0},{"$f":"IF(C73=\"G\",'Offerte goederen'!S96,IF(C73=\"M\",'Offerte montage'!M96,\"\"))","v":0},null,{"$f":"IF(C73=\"G\",'Offerte goederen'!U96,IF(C73=\"M\",'Offerte montage'!O96,\"\"))","v":0},null,{"$f":"IF(C73=\"G\",'Offerte goederen'!W96,IF(C73=\"M\",'Offerte montage'!Q96,\"\"))","v":""},null,{"$f":"IF(C73=\"G\",'Offerte goederen'!Y96,IF(C73=\"M\",'Offerte montage'!S96,\"\"))","v":""}]
[{"$f":"'Offerte goederen'!B97","v":0},{"$f":"CONCATENATE(IF('Offerte goederen'!C97=0,\"\",CONCATENATE('Offerte goederen'!C97,\", \")),IF('Offerte goederen'!O97=0,\"\",CONCATENATE(\"merk: \",'Offerte goederen'!O97)),IF('Offerte goederen'!N97=0,\"\",CONCATENATE(\", omschrijving: \",'Offerte goederen'!N97)),IF('Offerte goederen'!H97=0,\"\",CONCATENATE(\", plooi: \",'Offerte goederen'!H97)),IF('Offerte goederen'!J97=0,\"\",CONCATENATE(\", railtype: \",'Offerte goederen'!J97)),IF('Offerte goederen'!K97=0,\"\",CONCATENATE(\", railkleur: \",'Offerte goederen'!K97)))","v":""},"G",{"$f":"'Offerte goederen'!P97","v":0},null,{"$f":"IF(C74=\"G\",'Offerte goederen'!R97,IF(C74=\"M\",'Offerte montage'!L97,\"\"))","v":0},{"$f":"IF(C74=\"G\",'Offerte goederen'!S97,IF(C74=\"M\",'Offerte montage'!M97,\"\"))","v":0},null,{"$f":"IF(C74=\"G\",'Offerte goederen'!U97,IF(C74=\"M\",'Offerte montage'!O97,\"\"))","v":0},null,{"$f":"IF(C74=\"G\",'Offerte goederen'!W97,IF(C74=\"M\",'Offerte montage'!Q97,\"\"))","v":""},null,{"$f":"IF(C74=\"G\",'Offerte goederen'!Y97,IF(C74=\"M\",'Offerte montage'!S97,\"\"))","v":""}]
[{"$f":"'Offerte goederen'!B98","v":0},{"$f":"CONCATENATE(IF('Offerte goederen'!C98=0,\"\",CONCATENATE('Offerte goederen'!C98,\", \")),IF('Offerte goederen'!O98=0,\"\",CONCATENATE(\"merk: \",'Offerte goederen'!O98)),IF('Offerte goederen'!N98=0,\"\",CONCATENATE(\", omschrijving: \",'Offerte goederen'!N98)),IF('Offerte goederen'!H98=0,\"\",CONCATENATE(\", plooi: \",'Offerte goederen'!H98)),IF('Offerte goederen'!J98=0,\"\",CONCATENATE(\", railtype: \",'Offerte goederen'!J98)),IF('Offerte goederen'!K98=0,\"\",CONCATENATE(\", railkleur: \",'Offerte goederen'!K98)))","v":""},"G",{"$f":"'Offerte goederen'!P98","v":0},null,{"$f":"IF(C75=\"G\",'Offerte goederen'!R98,IF(C75=\"M\",'Offerte montage'!L98,\"\"))","v":0},{"$f":"IF(C75=\"G\",'Offerte goederen'!S98,IF(C75=\"M\",'Offerte montage'!M98,\"\"))","v":0},null,{"$f":"IF(C75=\"G\",'Offerte goederen'!U98,IF(C75=\"M\",'Offerte montage'!O98,\"\"))","v":0},null,{"$f":"IF(C75=\"G\",'Offerte goederen'!W98,IF(C75=\"M\",'Offerte montage'!Q98,\"\"))","v":""},null,{"$f":"IF(C75=\"G\",'Offerte goederen'!Y98,IF(C75=\"M\",'Offerte montage'!S98,\"\"))","v":""}]
[{"$f":"'Offerte goederen'!B99","v":0},{"$f":"CONCATENATE(IF('Offerte goederen'!C99=0,\"\",CONCATENATE('Offerte goederen'!C99,\", \")),IF('Offerte goederen'!O99=0,\"\",CONCATENATE(\"merk: \",'Offerte goederen'!O99)),IF('Offerte goederen'!N99=0,\"\",CONCATENATE(\", omschrijving: \",'Offerte goederen'!N99)),IF('Offerte goederen'!H99=0,\"\",CONCATENATE(\", plooi: \",'Offerte goederen'!H99)),IF('Offerte goederen'!J99=0,\"\",CONCATENATE(\", railtype: \",'Offerte goederen'!J99)),IF('Offerte goederen'!K99=0,\"\",CONCATENATE(\", railkleur: \",'Offerte goederen'!K99)))","v":""},"G",{"$f":"'Offerte goederen'!P99","v":0},null,{"$f":"IF(C76=\"G\",'Offerte goederen'!R99,IF(C76=\"M\",'Offerte montage'!L99,\"\"))","v":0},{"$f":"IF(C76=\"G\",'Offerte goederen'!S99,IF(C76=\"M\",'Offerte montage'!M99,\"\"))","v":0},null,{"$f":"IF(C76=\"G\",'Offerte goederen'!U99,IF(C76=\"M\",'Offerte montage'!O99,\"\"))","v":0},null,{"$f":"IF(C76=\"G\",'Offerte goederen'!W99,IF(C76=\"M\",'Offerte montage'!Q99,\"\"))","v":""},null,{"$f":"IF(C76=\"G\",'Offerte goederen'!Y99,IF(C76=\"M\",'Offerte montage'!S99,\"\"))","v":""}]
[{"$f":"'Offerte goederen'!B100","v":0},{"$f":"CONCATENATE(IF('Offerte goederen'!C100=0,\"\",CONCATENATE('Offerte goederen'!C100,\", \")),IF('Offerte goederen'!O100=0,\"\",CONCATENATE(\"merk: \",'Offerte goederen'!O100)),IF('Offerte goederen'!N100=0,\"\",CONCATENATE(\", omschrijving: \",'Offerte goederen'!N100)),IF('Offerte goederen'!H100=0,\"\",CONCATENATE(\", plooi: \",'Offerte goederen'!H100)),IF('Offerte goederen'!J100=0,\"\",CONCATENATE(\", railtype: \",'Offerte goederen'!J100)),IF('Offerte goederen'!K100=0,\"\",CONCATENATE(\", railkleur: \",'Offerte goederen'!K100)))","v":""},"G",{"$f":"'Offerte goederen'!P100","v":0},null,{"$f":"IF(C77=\"G\",'Offerte goederen'!R100,IF(C77=\"M\",'Offerte montage'!L100,\"\"))","v":0},{"$f":"IF(C77=\"G\",'Offerte goederen'!S100,IF(C77=\"M\",'Offerte montage'!M100,\"\"))","v":0},null,{"$f":"IF(C77=\"G\",'Offerte goederen'!U100,IF(C77=\"M\",'Offerte montage'!O100,\"\"))","v":0},null,{"$f":"IF(C77=\"G\",'Offerte goederen'!W100,IF(C77=\"M\",'Offerte montage'!Q100,\"\"))","v":""},null,{"$f":"IF(C77=\"G\",'Offerte goederen'!Y100,IF(C77=\"M\",'Offerte montage'!S100,\"\"))","v":""}]
[{"$f":"'Offerte goederen'!B101","v":0},{"$f":"CONCATENATE(IF('Offerte goederen'!C101=0,\"\",CONCATENATE('Offerte goederen'!C101,\", \")),IF('Offerte goederen'!O101=0,\"\",CONCATENATE(\"merk: \",'Offerte goederen'!O101)),IF('Offerte goederen'!N101=0,\"\",CONCATENATE(\", omschrijving: \",'Offerte goederen'!N101)),IF('Offerte goederen'!H101=0,\"\",CONCATENATE(\", plooi: \",'Offerte goederen'!H101)),IF('Offerte goederen'!J101=0,\"\",CONCATENATE(\", railtype: \",'Offerte goederen'!J101)),IF('Offerte goederen'!K101=0,\"\",CONCATENATE(\", railkleur: \",'Offerte goederen'!K101)))","v":""},"G",{"$f":"'Offerte goederen'!P101","v":0},null,{"$f":"IF(C78=\"G\",'Offerte goederen'!R101,IF(C78=\"M\",'Offerte montage'!L101,\"\"))","v":0},{"$f":"IF(C78=\"G\",'Offerte goederen'!S101,IF(C78=\"M\",'Offerte montage'!M101,\"\"))","v":0},null,{"$f":"IF(C78=\"G\",'Offerte goederen'!U101,IF(C78=\"M\",'Offerte montage'!O101,\"\"))","v":0},null,{"$f":"IF(C78=\"G\",'Offerte goederen'!W101,IF(C78=\"M\",'Offerte montage'!Q101,\"\"))","v":""},null,{"$f":"IF(C78=\"G\",'Offerte goederen'!Y101,IF(C78=\"M\",'Offerte montage'!S101,\"\"))","v":""}]
[{"$f":"'Offerte goederen'!B102","v":0},{"$f":"CONCATENATE(IF('Offerte goederen'!C102=0,\"\",CONCATENATE('Offerte goederen'!C102,\", \")),IF('Offerte goederen'!O102=0,\"\",CONCATENATE(\"merk: \",'Offerte goederen'!O102)),IF('Offerte goederen'!N102=0,\"\",CONCATENATE(\", omschrijving: \",'Offerte goederen'!N102)),IF('Offerte goederen'!H102=0,\"\",CONCATENATE(\", plooi: \",'Offerte goederen'!H102)),IF('Offerte goederen'!J102=0,\"\",CONCATENATE(\", railtype: \",'Offerte goederen'!J102)),IF('Offerte goederen'!K102=0,\"\",CONCATENATE(\", railkleur: \",'Offerte goederen'!K102)))","v":""},"G",{"$f":"'Offerte goederen'!P102","v":0},null,{"$f":"IF(C79=\"G\",'Offerte goederen'!R102,IF(C79=\"M\",'Offerte montage'!L102,\"\"))","v":0},{"$f":"IF(C79=\"G\",'Offerte goederen'!S102,IF(C79=\"M\",'Offerte montage'!M102,\"\"))","v":0},null,{"$f":"IF(C79=\"G\",'Offerte goederen'!U102,IF(C79=\"M\",'Offerte montage'!O102,\"\"))","v":0},null,{"$f":"IF(C79=\"G\",'Offerte goederen'!W102,IF(C79=\"M\",'Offerte montage'!Q102,\"\"))","v":""},null,{"$f":"IF(C79=\"G\",'Offerte goederen'!Y102,IF(C79=\"M\",'Offerte montage'!S102,\"\"))","v":""}]
[{"$f":"'Offerte goederen'!B103","v":0},{"$f":"CONCATENATE(IF('Offerte goederen'!C103=0,\"\",CONCATENATE('Offerte goederen'!C103,\", \")),IF('Offerte goederen'!O103=0,\"\",CONCATENATE(\"merk: \",'Offerte goederen'!O103)),IF('Offerte goederen'!N103=0,\"\",CONCATENATE(\", omschrijving: \",'Offerte goederen'!N103)),IF('Offerte goederen'!H103=0,\"\",CONCATENATE(\", plooi: \",'Offerte goederen'!H103)),IF('Offerte goederen'!J103=0,\"\",CONCATENATE(\", railtype: \",'Offerte goederen'!J103)),IF('Offerte goederen'!K103=0,\"\",CONCATENATE(\", railkleur: \",'Offerte goederen'!K103)))","v":""},"G",{"$f":"'Offerte goederen'!P103","v":0},null,{"$f":"IF(C80=\"G\",'Offerte goederen'!R103,IF(C80=\"M\",'Offerte montage'!L103,\"\"))","v":0},{"$f":"IF(C80=\"G\",'Offerte goederen'!S103,IF(C80=\"M\",'Offerte montage'!M103,\"\"))","v":0},null,{"$f":"IF(C80=\"G\",'Offerte goederen'!U103,IF(C80=\"M\",'Offerte montage'!O103,\"\"))","v":0},null,{"$f":"IF(C80=\"G\",'Offerte goederen'!W103,IF(C80=\"M\",'Offerte montage'!Q103,\"\"))","v":""},null,{"$f":"IF(C80=\"G\",'Offerte goederen'!Y103,IF(C80=\"M\",'Offerte montage'!S103,\"\"))","v":""}]
[{"$f":"'Offerte goederen'!B104","v":0},{"$f":"CONCATENATE(IF('Offerte goederen'!C104=0,\"\",CONCATENATE('Offerte goederen'!C104,\", \")),IF('Offerte goederen'!O104=0,\"\",CONCATENATE(\"merk: \",'Offerte goederen'!O104)),IF('Offerte goederen'!N104=0,\"\",CONCATENATE(\", omschrijving: \",'Offerte goederen'!N104)),IF('Offerte goederen'!H104=0,\"\",CONCATENATE(\", plooi: \",'Offerte goederen'!H104)),IF('Offerte goederen'!J104=0,\"\",CONCATENATE(\", railtype: \",'Offerte goederen'!J104)),IF('Offerte goederen'!K104=0,\"\",CONCATENATE(\", railkleur: \",'Offerte goederen'!K104)))","v":""},"G",{"$f":"'Offerte goederen'!P104","v":0},null,{"$f":"IF(C81=\"G\",'Offerte goederen'!R104,IF(C81=\"M\",'Offerte montage'!L104,\"\"))","v":0},{"$f":"IF(C81=\"G\",'Offerte goederen'!S104,IF(C81=\"M\",'Offerte montage'!M104,\"\"))","v":0},null,{"$f":"IF(C81=\"G\",'Offerte goederen'!U104,IF(C81=\"M\",'Offerte montage'!O104,\"\"))","v":0},null,{"$f":"IF(C81=\"G\",'Offerte goederen'!W104,IF(C81=\"M\",'Offerte montage'!Q104,\"\"))","v":""},null,{"$f":"IF(C81=\"G\",'Offerte goederen'!Y104,IF(C81=\"M\",'Offerte montage'!S104,\"\"))","v":""}]
[{"$f":"'Offerte goederen'!B105","v":0},{"$f":"CONCATENATE(IF('Offerte goederen'!C105=0,\"\",CONCATENATE('Offerte goederen'!C105,\", \")),IF('Offerte goederen'!O105=0,\"\",CONCATENATE(\"merk: \",'Offerte goederen'!O105)),IF('Offerte goederen'!N105=0,\"\",CONCATENATE(\", omschrijving: \",'Offerte goederen'!N105)),IF('Offerte goederen'!H105=0,\"\",CONCATENATE(\", plooi: \",'Offerte goederen'!H105)),IF('Offerte goederen'!J105=0,\"\",CONCATENATE(\", railtype: \",'Offerte goederen'!J105)),IF('Offerte goederen'!K105=0,\"\",CONCATENATE(\", railkleur: \",'Offerte goederen'!K105)))","v":""},"G",{"$f":"'Offerte goederen'!P105","v":0},null,{"$f":"IF(C82=\"G\",'Offerte goederen'!R105,IF(C82=\"M\",'Offerte montage'!L105,\"\"))","v":0},{"$f":"IF(C82=\"G\",'Offerte goederen'!S105,IF(C82=\"M\",'Offerte montage'!M105,\"\"))","v":0},null,{"$f":"IF(C82=\"G\",'Offerte goederen'!U105,IF(C82=\"M\",'Offerte montage'!O105,\"\"))","v":0},null,{"$f":"IF(C82=\"G\",'Offerte goederen'!W105,IF(C82=\"M\",'Offerte montage'!Q105,\"\"))","v":""},null,{"$f":"IF(C82=\"G\",'Offerte goederen'!Y105,IF(C82=\"M\",'Offerte montage'!S105,\"\"))","v":""}]
[{"$f":"'Offerte goederen'!B106","v":0},{"$f":"CONCATENATE(IF('Offerte goederen'!C106=0,\"\",CONCATENATE('Offerte goederen'!C106,\", \")),IF('Offerte goederen'!O106=0,\"\",CONCATENATE(\"merk: \",'Offerte goederen'!O106)),IF('Offerte goederen'!N106=0,\"\",CONCATENATE(\", omschrijving: \",'Offerte goederen'!N106)),IF('Offerte goederen'!H106=0,\"\",CONCATENATE(\", plooi: \",'Offerte goederen'!H106)),IF('Offerte goederen'!J106=0,\"\",CONCATENATE(\", railtype: \",'Offerte goederen'!J106)),IF('Offerte goederen'!K106=0,\"\",CONCATENATE(\", railkleur: \",'Offerte goederen'!K106)))","v":""},"G",{"$f":"'Offerte goederen'!P106","v":0},null,{"$f":"IF(C83=\"G\",'Offerte goederen'!R106,IF(C83=\"M\",'Offerte montage'!L106,\"\"))","v":0},{"$f":"IF(C83=\"G\",'Offerte goederen'!S106,IF(C83=\"M\",'Offerte montage'!M106,\"\"))","v":0},null,{"$f":"IF(C83=\"G\",'Offerte goederen'!U106,IF(C83=\"M\",'Offerte montage'!O106,\"\"))","v":0},null,{"$f":"IF(C83=\"G\",'Offerte goederen'!W106,IF(C83=\"M\",'Offerte montage'!Q106,\"\"))","v":""},null,{"$f":"IF(C83=\"G\",'Offerte goederen'!Y106,IF(C83=\"M\",'Offerte montage'!S106,\"\"))","v":""}]
[{"$f":"'Offerte goederen'!B107","v":0},{"$f":"CONCATENATE(IF('Offerte goederen'!C107=0,\"\",CONCATENATE('Offerte goederen'!C107,\", \")),IF('Offerte goederen'!O107=0,\"\",CONCATENATE(\"merk: \",'Offerte goederen'!O107)),IF('Offerte goederen'!N107=0,\"\",CONCATENATE(\", omschrijving: \",'Offerte goederen'!N107)),IF('Offerte goederen'!H107=0,\"\",CONCATENATE(\", plooi: \",'Offerte goederen'!H107)),IF('Offerte goederen'!J107=0,\"\",CONCATENATE(\", railtype: \",'Offerte goederen'!J107)),IF('Offerte goederen'!K107=0,\"\",CONCATENATE(\", railkleur: \",'Offerte goederen'!K107)))","v":""},"G",{"$f":"'Offerte goederen'!P107","v":0},null,{"$f":"IF(C84=\"G\",'Offerte goederen'!R107,IF(C84=\"M\",'Offerte montage'!L107,\"\"))","v":0},{"$f":"IF(C84=\"G\",'Offerte goederen'!S107,IF(C84=\"M\",'Offerte montage'!M107,\"\"))","v":0},null,{"$f":"IF(C84=\"G\",'Offerte goederen'!U107,IF(C84=\"M\",'Offerte montage'!O107,\"\"))","v":0},null,{"$f":"IF(C84=\"G\",'Offerte goederen'!W107,IF(C84=\"M\",'Offerte montage'!Q107,\"\"))","v":""},null,{"$f":"IF(C84=\"G\",'Offerte goederen'!Y107,IF(C84=\"M\",'Offerte montage'!S107,\"\"))","v":""}]
[{"$f":"'Offerte goederen'!B108","v":0},{"$f":"CONCATENATE(IF('Offerte goederen'!C108=0,\"\",CONCATENATE('Offerte goederen'!C108,\", \")),IF('Offerte goederen'!O108=0,\"\",CONCATENATE(\"merk: \",'Offerte goederen'!O108)),IF('Offerte goederen'!N108=0,\"\",CONCATENATE(\", omschrijving: \",'Offerte goederen'!N108)),IF('Offerte goederen'!H108=0,\"\",CONCATENATE(\", plooi: \",'Offerte goederen'!H108)),IF('Offerte goederen'!J108=0,\"\",CONCATENATE(\", railtype: \",'Offerte goederen'!J108)),IF('Offerte goederen'!K108=0,\"\",CONCATENATE(\", railkleur: \",'Offerte goederen'!K108)))","v":""},"G",{"$f":"'Offerte goederen'!P108","v":0},null,{"$f":"IF(C85=\"G\",'Offerte goederen'!R108,IF(C85=\"M\",'Offerte montage'!L108,\"\"))","v":0},{"$f":"IF(C85=\"G\",'Offerte goederen'!S108,IF(C85=\"M\",'Offerte montage'!M108,\"\"))","v":0},null,{"$f":"IF(C85=\"G\",'Offerte goederen'!U108,IF(C85=\"M\",'Offerte montage'!O108,\"\"))","v":0},null,{"$f":"IF(C85=\"G\",'Offerte goederen'!W108,IF(C85=\"M\",'Offerte montage'!Q108,\"\"))","v":""},null,{"$f":"IF(C85=\"G\",'Offerte goederen'!Y108,IF(C85=\"M\",'Offerte montage'!S108,\"\"))","v":""}]
[{"$f":"'Offerte goederen'!B109","v":0},{"$f":"CONCATENATE(IF('Offerte goederen'!C109=0,\"\",CONCATENATE('Offerte goederen'!C109,\", \")),IF('Offerte goederen'!O109=0,\"\",CONCATENATE(\"merk: \",'Offerte goederen'!O109)),IF('Offerte goederen'!N109=0,\"\",CONCATENATE(\", omschrijving: \",'Offerte goederen'!N109)),IF('Offerte goederen'!H109=0,\"\",CONCATENATE(\", plooi: \",'Offerte goederen'!H109)),IF('Offerte goederen'!J109=0,\"\",CONCATENATE(\", railtype: \",'Offerte goederen'!J109)),IF('Offerte goederen'!K109=0,\"\",CONCATENATE(\", railkleur: \",'Offerte goederen'!K109)))","v":""},"G",{"$f":"'Offerte goederen'!P109","v":0},null,{"$f":"IF(C86=\"G\",'Offerte goederen'!R109,IF(C86=\"M\",'Offerte montage'!L109,\"\"))","v":0},{"$f":"IF(C86=\"G\",'Offerte goederen'!S109,IF(C86=\"M\",'Offerte montage'!M109,\"\"))","v":0},null,{"$f":"IF(C86=\"G\",'Offerte goederen'!U109,IF(C86=\"M\",'Offerte montage'!O109,\"\"))","v":0},null,{"$f":"IF(C86=\"G\",'Offerte goederen'!W109,IF(C86=\"M\",'Offerte montage'!Q109,\"\"))","v":""},null,{"$f":"IF(C86=\"G\",'Offerte goederen'!Y109,IF(C86=\"M\",'Offerte montage'!S109,\"\"))","v":""}]
[{"$f":"'Offerte goederen'!B110","v":0},{"$f":"CONCATENATE(IF('Offerte goederen'!C110=0,\"\",CONCATENATE('Offerte goederen'!C110,\", \")),IF('Offerte goederen'!O110=0,\"\",CONCATENATE(\"merk: \",'Offerte goederen'!O110)),IF('Offerte goederen'!N110=0,\"\",CONCATENATE(\", omschrijving: \",'Offerte goederen'!N110)),IF('Offerte goederen'!H110=0,\"\",CONCATENATE(\", plooi: \",'Offerte goederen'!H110)),IF('Offerte goederen'!J110=0,\"\",CONCATENATE(\", railtype: \",'Offerte goederen'!J110)),IF('Offerte goederen'!K110=0,\"\",CONCATENATE(\", railkleur: \",'Offerte goederen'!K110)))","v":""},"G",{"$f":"'Offerte goederen'!P110","v":0},null,{"$f":"IF(C87=\"G\",'Offerte goederen'!R110,IF(C87=\"M\",'Offerte montage'!L110,\"\"))","v":0},{"$f":"IF(C87=\"G\",'Offerte goederen'!S110,IF(C87=\"M\",'Offerte montage'!M110,\"\"))","v":0},null,{"$f":"IF(C87=\"G\",'Offerte goederen'!U110,IF(C87=\"M\",'Offerte montage'!O110,\"\"))","v":0},null,{"$f":"IF(C87=\"G\",'Offerte goederen'!W110,IF(C87=\"M\",'Offerte montage'!Q110,\"\"))","v":""},null,{"$f":"IF(C87=\"G\",'Offerte goederen'!Y110,IF(C87=\"M\",'Offerte montage'!S110,\"\"))","v":""}]
[{"$f":"'Offerte goederen'!B111","v":0},{"$f":"CONCATENATE(IF('Offerte goederen'!C111=0,\"\",CONCATENATE('Offerte goederen'!C111,\", \")),IF('Offerte goederen'!O111=0,\"\",CONCATENATE(\"merk: \",'Offerte goederen'!O111)),IF('Offerte goederen'!N111=0,\"\",CONCATENATE(\", omschrijving: \",'Offerte goederen'!N111)),IF('Offerte goederen'!H111=0,\"\",CONCATENATE(\", plooi: \",'Offerte goederen'!H111)),IF('Offerte goederen'!J111=0,\"\",CONCATENATE(\", railtype: \",'Offerte goederen'!J111)),IF('Offerte goederen'!K111=0,\"\",CONCATENATE(\", railkleur: \",'Offerte goederen'!K111)))","v":""},"G",{"$f":"'Offerte goederen'!P111","v":0},null,{"$f":"IF(C88=\"G\",'Offerte goederen'!R111,IF(C88=\"M\",'Offerte montage'!L111,\"\"))","v":0},{"$f":"IF(C88=\"G\",'Offerte goederen'!S111,IF(C88=\"M\",'Offerte montage'!M111,\"\"))","v":0},null,{"$f":"IF(C88=\"G\",'Offerte goederen'!U111,IF(C88=\"M\",'Offerte montage'!O111,\"\"))","v":0},null,{"$f":"IF(C88=\"G\",'Offerte goederen'!W111,IF(C88=\"M\",'Offerte montage'!Q111,\"\"))","v":""},null,{"$f":"IF(C88=\"G\",'Offerte goederen'!Y111,IF(C88=\"M\",'Offerte montage'!S111,\"\"))","v":""}]
[{"$f":"'Offerte goederen'!B112","v":0},{"$f":"CONCATENATE(IF('Offerte goederen'!C112=0,\"\",CONCATENATE('Offerte goederen'!C112,\", \")),IF('Offerte goederen'!O112=0,\"\",CONCATENATE(\"merk: \",'Offerte goederen'!O112)),IF('Offerte goederen'!N112=0,\"\",CONCATENATE(\", omschrijving: \",'Offerte goederen'!N112)),IF('Offerte goederen'!H112=0,\"\",CONCATENATE(\", plooi: \",'Offerte goederen'!H112)),IF('Offerte goederen'!J112=0,\"\",CONCATENATE(\", railtype: \",'Offerte goederen'!J112)),IF('Offerte goederen'!K112=0,\"\",CONCATENATE(\", railkleur: \",'Offerte goederen'!K112)))","v":""},"G",{"$f":"'Offerte goederen'!P112","v":0},null,{"$f":"IF(C89=\"G\",'Offerte goederen'!R112,IF(C89=\"M\",'Offerte montage'!L112,\"\"))","v":0},{"$f":"IF(C89=\"G\",'Offerte goederen'!S112,IF(C89=\"M\",'Offerte montage'!M112,\"\"))","v":0},null,{"$f":"IF(C89=\"G\",'Offerte goederen'!U112,IF(C89=\"M\",'Offerte montage'!O112,\"\"))","v":0},null,{"$f":"IF(C89=\"G\",'Offerte goederen'!W112,IF(C89=\"M\",'Offerte montage'!Q112,\"\"))","v":""},null,{"$f":"IF(C89=\"G\",'Offerte goederen'!Y112,IF(C89=\"M\",'Offerte montage'!S112,\"\"))","v":""}]
[{"$f":"'Offerte goederen'!B113","v":0},{"$f":"CONCATENATE(IF('Offerte goederen'!C113=0,\"\",CONCATENATE('Offerte goederen'!C113,\", \")),IF('Offerte goederen'!O113=0,\"\",CONCATENATE(\"merk: \",'Offerte goederen'!O113)),IF('Offerte goederen'!N113=0,\"\",CONCATENATE(\", omschrijving: \",'Offerte goederen'!N113)),IF('Offerte goederen'!H113=0,\"\",CONCATENATE(\", plooi: \",'Offerte goederen'!H113)),IF('Offerte goederen'!J113=0,\"\",CONCATENATE(\", railtype: \",'Offerte goederen'!J113)),IF('Offerte goederen'!K113=0,\"\",CONCATENATE(\", railkleur: \",'Offerte goederen'!K113)))","v":""},"G",{"$f":"'Offerte goederen'!P113","v":0},null,{"$f":"IF(C90=\"G\",'Offerte goederen'!R113,IF(C90=\"M\",'Offerte montage'!L113,\"\"))","v":0},{"$f":"IF(C90=\"G\",'Offerte goederen'!S113,IF(C90=\"M\",'Offerte montage'!M113,\"\"))","v":0},null,{"$f":"IF(C90=\"G\",'Offerte goederen'!U113,IF(C90=\"M\",'Offerte montage'!O113,\"\"))","v":0},null,{"$f":"IF(C90=\"G\",'Offerte goederen'!W113,IF(C90=\"M\",'Offerte montage'!Q113,\"\"))","v":""},null,{"$f":"IF(C90=\"G\",'Offerte goederen'!Y113,IF(C90=\"M\",'Offerte montage'!S113,\"\"))","v":""}]
[{"$f":"'Offerte goederen'!B114","v":0},{"$f":"CONCATENATE(IF('Offerte goederen'!C114=0,\"\",CONCATENATE('Offerte goederen'!C114,\", \")),IF('Offerte goederen'!O114=0,\"\",CONCATENATE(\"merk: \",'Offerte goederen'!O114)),IF('Offerte goederen'!N114=0,\"\",CONCATENATE(\", omschrijving: \",'Offerte goederen'!N114)),IF('Offerte goederen'!H114=0,\"\",CONCATENATE(\", plooi: \",'Offerte goederen'!H114)),IF('Offerte goederen'!J114=0,\"\",CONCATENATE(\", railtype: \",'Offerte goederen'!J114)),IF('Offerte goederen'!K114=0,\"\",CONCATENATE(\", railkleur: \",'Offerte goederen'!K114)))","v":""},"G",{"$f":"'Offerte goederen'!P114","v":0},null,{"$f":"IF(C91=\"G\",'Offerte goederen'!R114,IF(C91=\"M\",'Offerte montage'!L114,\"\"))","v":0},{"$f":"IF(C91=\"G\",'Offerte goederen'!S114,IF(C91=\"M\",'Offerte montage'!M114,\"\"))","v":0},null,{"$f":"IF(C91=\"G\",'Offerte goederen'!U114,IF(C91=\"M\",'Offerte montage'!O114,\"\"))","v":0},null,{"$f":"IF(C91=\"G\",'Offerte goederen'!W114,IF(C91=\"M\",'Offerte montage'!Q114,\"\"))","v":""},null,{"$f":"IF(C91=\"G\",'Offerte goederen'!Y114,IF(C91=\"M\",'Offerte montage'!S114,\"\"))","v":""}]
[{"$f":"'Offerte goederen'!B115","v":0},{"$f":"CONCATENATE(IF('Offerte goederen'!C115=0,\"\",CONCATENATE('Offerte goederen'!C115,\", \")),IF('Offerte goederen'!O115=0,\"\",CONCATENATE(\"merk: \",'Offerte goederen'!O115)),IF('Offerte goederen'!N115=0,\"\",CONCATENATE(\", omschrijving: \",'Offerte goederen'!N115)),IF('Offerte goederen'!H115=0,\"\",CONCATENATE(\", plooi: \",'Offerte goederen'!H115)),IF('Offerte goederen'!J115=0,\"\",CONCATENATE(\", railtype: \",'Offerte goederen'!J115)),IF('Offerte goederen'!K115=0,\"\",CONCATENATE(\", railkleur: \",'Offerte goederen'!K115)))","v":""},"G",{"$f":"'Offerte goederen'!P115","v":0},null,{"$f":"IF(C92=\"G\",'Offerte goederen'!R115,IF(C92=\"M\",'Offerte montage'!L115,\"\"))","v":0},{"$f":"IF(C92=\"G\",'Offerte goederen'!S115,IF(C92=\"M\",'Offerte montage'!M115,\"\"))","v":0},null,{"$f":"IF(C92=\"G\",'Offerte goederen'!U115,IF(C92=\"M\",'Offerte montage'!O115,\"\"))","v":0},null,{"$f":"IF(C92=\"G\",'Offerte goederen'!W115,IF(C92=\"M\",'Offerte montage'!Q115,\"\"))","v":""},null,{"$f":"IF(C92=\"G\",'Offerte goederen'!Y115,IF(C92=\"M\",'Offerte montage'!S115,\"\"))","v":""}]
[{"$f":"'Offerte goederen'!B116","v":0},{"$f":"CONCATENATE(IF('Offerte goederen'!C116=0,\"\",CONCATENATE('Offerte goederen'!C116,\", \")),IF('Offerte goederen'!O116=0,\"\",CONCATENATE(\"merk: \",'Offerte goederen'!O116)),IF('Offerte goederen'!N116=0,\"\",CONCATENATE(\", omschrijving: \",'Offerte goederen'!N116)),IF('Offerte goederen'!H116=0,\"\",CONCATENATE(\", plooi: \",'Offerte goederen'!H116)),IF('Offerte goederen'!J116=0,\"\",CONCATENATE(\", railtype: \",'Offerte goederen'!J116)),IF('Offerte goederen'!K116=0,\"\",CONCATENATE(\", railkleur: \",'Offerte goederen'!K116)))","v":""},"G",{"$f":"'Offerte goederen'!P116","v":0},null,{"$f":"IF(C93=\"G\",'Offerte goederen'!R116,IF(C93=\"M\",'Offerte montage'!L116,\"\"))","v":0},{"$f":"IF(C93=\"G\",'Offerte goederen'!S116,IF(C93=\"M\",'Offerte montage'!M116,\"\"))","v":0},null,{"$f":"IF(C93=\"G\",'Offerte goederen'!U116,IF(C93=\"M\",'Offerte montage'!O116,\"\"))","v":0},null,{"$f":"IF(C93=\"G\",'Offerte goederen'!W116,IF(C93=\"M\",'Offerte montage'!Q116,\"\"))","v":""},null,{"$f":"IF(C93=\"G\",'Offerte goederen'!Y116,IF(C93=\"M\",'Offerte montage'!S116,\"\"))","v":""}]
[{"$f":"'Offerte goederen'!B117","v":0},{"$f":"CONCATENATE(IF('Offerte goederen'!C117=0,\"\",CONCATENATE('Offerte goederen'!C117,\", \")),IF('Offerte goederen'!O117=0,\"\",CONCATENATE(\"merk: \",'Offerte goederen'!O117)),IF('Offerte goederen'!N117=0,\"\",CONCATENATE(\", omschrijving: \",'Offerte goederen'!N117)),IF('Offerte goederen'!H117=0,\"\",CONCATENATE(\", plooi: \",'Offerte goederen'!H117)),IF('Offerte goederen'!J117=0,\"\",CONCATENATE(\", railtype: \",'Offerte goederen'!J117)),IF('Offerte goederen'!K117=0,\"\",CONCATENATE(\", railkleur: \",'Offerte goederen'!K117)))","v":""},"G",{"$f":"'Offerte goederen'!P117","v":0},null,{"$f":"IF(C94=\"G\",'Offerte goederen'!R117,IF(C94=\"M\",'Offerte montage'!L117,\"\"))","v":0},{"$f":"IF(C94=\"G\",'Offerte goederen'!S117,IF(C94=\"M\",'Offerte montage'!M117,\"\"))","v":0},null,{"$f":"IF(C94=\"G\",'Offerte goederen'!U117,IF(C94=\"M\",'Offerte montage'!O117,\"\"))","v":0},null,{"$f":"IF(C94=\"G\",'Offerte goederen'!W117,IF(C94=\"M\",'Offerte montage'!Q117,\"\"))","v":""},null,{"$f":"IF(C94=\"G\",'Offerte goederen'!Y117,IF(C94=\"M\",'Offerte montage'!S117,\"\"))","v":""}]
[{"$f":"'Offerte goederen'!B118","v":0},{"$f":"CONCATENATE(IF('Offerte goederen'!C118=0,\"\",CONCATENATE('Offerte goederen'!C118,\", \")),IF('Offerte goederen'!O118=0,\"\",CONCATENATE(\"merk: \",'Offerte goederen'!O118)),IF('Offerte goederen'!N118=0,\"\",CONCATENATE(\", omschrijving: \",'Offerte goederen'!N118)),IF('Offerte goederen'!H118=0,\"\",CONCATENATE(\", plooi: \",'Offerte goederen'!H118)),IF('Offerte goederen'!J118=0,\"\",CONCATENATE(\", railtype: \",'Offerte goederen'!J118)),IF('Offerte goederen'!K118=0,\"\",CONCATENATE(\", railkleur: \",'Offerte goederen'!K118)))","v":""},"G",{"$f":"'Offerte goederen'!P118","v":0},null,{"$f":"IF(C95=\"G\",'Offerte goederen'!R118,IF(C95=\"M\",'Offerte montage'!L118,\"\"))","v":0},{"$f":"IF(C95=\"G\",'Offerte goederen'!S118,IF(C95=\"M\",'Offerte montage'!M118,\"\"))","v":0},null,{"$f":"IF(C95=\"G\",'Offerte goederen'!U118,IF(C95=\"M\",'Offerte montage'!O118,\"\"))","v":0},null,{"$f":"IF(C95=\"G\",'Offerte goederen'!W118,IF(C95=\"M\",'Offerte montage'!Q118,\"\"))","v":""},null,{"$f":"IF(C95=\"G\",'Offerte goederen'!Y118,IF(C95=\"M\",'Offerte montage'!S118,\"\"))","v":""}]
[{"$f":"'Offerte goederen'!B119","v":0},{"$f":"CONCATENATE(IF('Offerte goederen'!C119=0,\"\",CONCATENATE('Offerte goederen'!C119,\", \")),IF('Offerte goederen'!O119=0,\"\",CONCATENATE(\"merk: \",'Offerte goederen'!O119)),IF('Offerte goederen'!N119=0,\"\",CONCATENATE(\", omschrijving: \",'Offerte goederen'!N119)),IF('Offerte goederen'!H119=0,\"\",CONCATENATE(\", plooi: \",'Offerte goederen'!H119)),IF('Offerte goederen'!J119=0,\"\",CONCATENATE(\", railtype: \",'Offerte goederen'!J119)),IF('Offerte goederen'!K119=0,\"\",CONCATENATE(\", railkleur: \",'Offerte goederen'!K119)))","v":""},"G",{"$f":"'Offerte goederen'!P119","v":0},null,{"$f":"IF(C96=\"G\",'Offerte goederen'!R119,IF(C96=\"M\",'Offerte montage'!L119,\"\"))","v":0},{"$f":"IF(C96=\"G\",'Offerte goederen'!S119,IF(C96=\"M\",'Offerte montage'!M119,\"\"))","v":0},null,{"$f":"IF(C96=\"G\",'Offerte goederen'!U119,IF(C96=\"M\",'Offerte montage'!O119,\"\"))","v":0},null,{"$f":"IF(C96=\"G\",'Offerte goederen'!W119,IF(C96=\"M\",'Offerte montage'!Q119,\"\"))","v":""},null,{"$f":"IF(C96=\"G\",'Offerte goederen'!Y119,IF(C96=\"M\",'Offerte montage'!S119,\"\"))","v":""}]
[{"$f":"'Offerte goederen'!B120","v":0},{"$f":"CONCATENATE(IF('Offerte goederen'!C120=0,\"\",CONCATENATE('Offerte goederen'!C120,\", \")),IF('Offerte goederen'!O120=0,\"\",CONCATENATE(\"merk: \",'Offerte goederen'!O120)),IF('Offerte goederen'!N120=0,\"\",CONCATENATE(\", omschrijving: \",'Offerte goederen'!N120)),IF('Offerte goederen'!H120=0,\"\",CONCATENATE(\", plooi: \",'Offerte goederen'!H120)),IF('Offerte goederen'!J120=0,\"\",CONCATENATE(\", railtype: \",'Offerte goederen'!J120)),IF('Offerte goederen'!K120=0,\"\",CONCATENATE(\", railkleur: \",'Offerte goederen'!K120)))","v":""},"G",{"$f":"'Offerte goederen'!P120","v":0},null,{"$f":"IF(C97=\"G\",'Offerte goederen'!R120,IF(C97=\"M\",'Offerte montage'!L120,\"\"))","v":0},{"$f":"IF(C97=\"G\",'Offerte goederen'!S120,IF(C97=\"M\",'Offerte montage'!M120,\"\"))","v":0},null,{"$f":"IF(C97=\"G\",'Offerte goederen'!U120,IF(C97=\"M\",'Offerte montage'!O120,\"\"))","v":0},null,{"$f":"IF(C97=\"G\",'Offerte goederen'!W120,IF(C97=\"M\",'Offerte montage'!Q120,\"\"))","v":""},null,{"$f":"IF(C97=\"G\",'Offerte goederen'!Y120,IF(C97=\"M\",'Offerte montage'!S120,\"\"))","v":""}]
[{"$f":"'Offerte goederen'!B121","v":0},{"$f":"CONCATENATE(IF('Offerte goederen'!C121=0,\"\",CONCATENATE('Offerte goederen'!C121,\", \")),IF('Offerte goederen'!O121=0,\"\",CONCATENATE(\"merk: \",'Offerte goederen'!O121)),IF('Offerte goederen'!N121=0,\"\",CONCATENATE(\", omschrijving: \",'Offerte goederen'!N121)),IF('Offerte goederen'!H121=0,\"\",CONCATENATE(\", plooi: \",'Offerte goederen'!H121)),IF('Offerte goederen'!J121=0,\"\",CONCATENATE(\", railtype: \",'Offerte goederen'!J121)),IF('Offerte goederen'!K121=0,\"\",CONCATENATE(\", railkleur: \",'Offerte goederen'!K121)))","v":""},"G",{"$f":"'Offerte goederen'!P121","v":0},null,{"$f":"IF(C98=\"G\",'Offerte goederen'!R121,IF(C98=\"M\",'Offerte montage'!L121,\"\"))","v":0},{"$f":"IF(C98=\"G\",'Offerte goederen'!S121,IF(C98=\"M\",'Offerte montage'!M121,\"\"))","v":0},null,{"$f":"IF(C98=\"G\",'Offerte goederen'!U121,IF(C98=\"M\",'Offerte montage'!O121,\"\"))","v":0},null,{"$f":"IF(C98=\"G\",'Offerte goederen'!W121,IF(C98=\"M\",'Offerte montage'!Q121,\"\"))","v":""},null,{"$f":"IF(C98=\"G\",'Offerte goederen'!Y121,IF(C98=\"M\",'Offerte montage'!S121,\"\"))","v":""}]
[{"$f":"'Offerte goederen'!B122","v":0},{"$f":"CONCATENATE(IF('Offerte goederen'!C122=0,\"\",CONCATENATE('Offerte goederen'!C122,\", \")),IF('Offerte goederen'!O122=0,\"\",CONCATENATE(\"merk: \",'Offerte goederen'!O122)),IF('Offerte goederen'!N122=0,\"\",CONCATENATE(\", omschrijving: \",'Offerte goederen'!N122)),IF('Offerte goederen'!H122=0,\"\",CONCATENATE(\", plooi: \",'Offerte goederen'!H122)),IF('Offerte goederen'!J122=0,\"\",CONCATENATE(\", railtype: \",'Offerte goederen'!J122)),IF('Offerte goederen'!K122=0,\"\",CONCATENATE(\", railkleur: \",'Offerte goederen'!K122)))","v":""},"G",{"$f":"'Offerte goederen'!P122","v":0},null,{"$f":"IF(C99=\"G\",'Offerte goederen'!R122,IF(C99=\"M\",'Offerte montage'!L122,\"\"))","v":0},{"$f":"IF(C99=\"G\",'Offerte goederen'!S122,IF(C99=\"M\",'Offerte montage'!M122,\"\"))","v":0},null,{"$f":"IF(C99=\"G\",'Offerte goederen'!U122,IF(C99=\"M\",'Offerte montage'!O122,\"\"))","v":0},null,{"$f":"IF(C99=\"G\",'Offerte goederen'!W122,IF(C99=\"M\",'Offerte montage'!Q122,\"\"))","v":""},null,{"$f":"IF(C99=\"G\",'Offerte goederen'!Y122,IF(C99=\"M\",'Offerte montage'!S122,\"\"))","v":""}]
[{"$f":"'Offerte goederen'!B123","v":0},{"$f":"CONCATENATE(IF('Offerte goederen'!C123=0,\"\",CONCATENATE('Offerte goederen'!C123,\", \")),IF('Offerte goederen'!O123=0,\"\",CONCATENATE(\"merk: \",'Offerte goederen'!O123)),IF('Offerte goederen'!N123=0,\"\",CONCATENATE(\", omschrijving: \",'Offerte goederen'!N123)),IF('Offerte goederen'!H123=0,\"\",CONCATENATE(\", plooi: \",'Offerte goederen'!H123)),IF('Offerte goederen'!J123=0,\"\",CONCATENATE(\", railtype: \",'Offerte goederen'!J123)),IF('Offerte goederen'!K123=0,\"\",CONCATENATE(\", railkleur: \",'Offerte goederen'!K123)))","v":""},"G",{"$f":"'Offerte goederen'!P123","v":0},null,{"$f":"IF(C100=\"G\",'Offerte goederen'!R123,IF(C100=\"M\",'Offerte montage'!L123,\"\"))","v":0},{"$f":"IF(C100=\"G\",'Offerte goederen'!S123,IF(C100=\"M\",'Offerte montage'!M123,\"\"))","v":0},null,{"$f":"IF(C100=\"G\",'Offerte goederen'!U123,IF(C100=\"M\",'Offerte montage'!O123,\"\"))","v":0},null,{"$f":"IF(C100=\"G\",'Offerte goederen'!W123,IF(C100=\"M\",'Offerte montage'!Q123,\"\"))","v":""},null,{"$f":"IF(C100=\"G\",'Offerte goederen'!Y123,IF(C100=\"M\",'Offerte montage'!S123,\"\"))","v":""}]
[{"$f":"'Offerte goederen'!B124","v":0},{"$f":"CONCATENATE(IF('Offerte goederen'!C124=0,\"\",CONCATENATE('Offerte goederen'!C124,\", \")),IF('Offerte goederen'!O124=0,\"\",CONCATENATE(\"merk: \",'Offerte goederen'!O124)),IF('Offerte goederen'!N124=0,\"\",CONCATENATE(\", omschrijving: \",'Offerte goederen'!N124)),IF('Offerte goederen'!H124=0,\"\",CONCATENATE(\", plooi: \",'Offerte goederen'!H124)),IF('Offerte goederen'!J124=0,\"\",CONCATENATE(\", railtype: \",'Offerte goederen'!J124)),IF('Offerte goederen'!K124=0,\"\",CONCATENATE(\", railkleur: \",'Offerte goederen'!K124)))","v":""},"G",{"$f":"'Offerte goederen'!P124","v":0},null,{"$f":"IF(C101=\"G\",'Offerte goederen'!R124,IF(C101=\"M\",'Offerte montage'!L124,\"\"))","v":0},{"$f":"IF(C101=\"G\",'Offerte goederen'!S124,IF(C101=\"M\",'Offerte montage'!M124,\"\"))","v":0},null,{"$f":"IF(C101=\"G\",'Offerte goederen'!U124,IF(C101=\"M\",'Offerte montage'!O124,\"\"))","v":0},null,{"$f":"IF(C101=\"G\",'Offerte goederen'!W124,IF(C101=\"M\",'Offerte montage'!Q124,\"\"))","v":""},null,{"$f":"IF(C101=\"G\",'Offerte goederen'!Y124,IF(C101=\"M\",'Offerte montage'!S124,\"\"))","v":""}]
[{"$f":"'Offerte goederen'!B125","v":0},{"$f":"CONCATENATE(IF('Offerte goederen'!C125=0,\"\",CONCATENATE('Offerte goederen'!C125,\", \")),IF('Offerte goederen'!O125=0,\"\",CONCATENATE(\"merk: \",'Offerte goederen'!O125)),IF('Offerte goederen'!N125=0,\"\",CONCATENATE(\", omschrijving: \",'Offerte goederen'!N125)),IF('Offerte goederen'!H125=0,\"\",CONCATENATE(\", plooi: \",'Offerte goederen'!H125)),IF('Offerte goederen'!J125=0,\"\",CONCATENATE(\", railtype: \",'Offerte goederen'!J125)),IF('Offerte goederen'!K125=0,\"\",CONCATENATE(\", railkleur: \",'Offerte goederen'!K125)))","v":""},"G",{"$f":"'Offerte goederen'!P125","v":0},null,{"$f":"IF(C102=\"G\",'Offerte goederen'!R125,IF(C102=\"M\",'Offerte montage'!L125,\"\"))","v":0},{"$f":"IF(C102=\"G\",'Offerte goederen'!S125,IF(C102=\"M\",'Offerte montage'!M125,\"\"))","v":0},null,{"$f":"IF(C102=\"G\",'Offerte goederen'!U125,IF(C102=\"M\",'Offerte montage'!O125,\"\"))","v":0},null,{"$f":"IF(C102=\"G\",'Offerte goederen'!W125,IF(C102=\"M\",'Offerte montage'!Q125,\"\"))","v":""},null,{"$f":"IF(C102=\"G\",'Offerte goederen'!Y125,IF(C102=\"M\",'Offerte montage'!S125,\"\"))","v":""}]
[{"$f":"'Offerte montage'!B25","v":0},{"$f":"IF('Offerte montage'!I25=100,'Offerte montage'!J25,'Offerte montage'!C25)","v":""},"M",{"$f":"IF('Offerte montage'!I25=100,\"\",'Offerte montage'!J25)","v":0},null,{"$f":"IF(C103=\"G\",'Offerte goederen'!R25,IF(C103=\"M\",'Offerte montage'!L25,\"\"))","v":""},{"$f":"IF(C103=\"G\",'Offerte goederen'!S25,IF(C103=\"M\",'Offerte montage'!M25,\"\"))","v":""},null,{"$f":"IF(C103=\"G\",'Offerte goederen'!U25,IF(C103=\"M\",'Offerte montage'!O25,\"\"))","v":0},null,{"$f":"IF(C103=\"G\",'Offerte goederen'!W25,IF(C103=\"M\",'Offerte montage'!Q25,\"\"))","v":""},null,{"$f":"IF(C103=\"G\",'Offerte goederen'!Y25,IF(C103=\"M\",'Offerte montage'!S25,\"\"))","v":""}]
[{"$f":"'Offerte montage'!B26","v":0},{"$f":"IF('Offerte montage'!I26=100,'Offerte montage'!J26,'Offerte montage'!C26)","v":""},"M",{"$f":"IF('Offerte montage'!I26=100,\"\",'Offerte montage'!J26)","v":0},null,{"$f":"IF(C104=\"G\",'Offerte goederen'!R26,IF(C104=\"M\",'Offerte montage'!L26,\"\"))","v":""},{"$f":"IF(C104=\"G\",'Offerte goederen'!S26,IF(C104=\"M\",'Offerte montage'!M26,\"\"))","v":""},null,{"$f":"IF(C104=\"G\",'Offerte goederen'!U26,IF(C104=\"M\",'Offerte montage'!O26,\"\"))","v":0},null,{"$f":"IF(C104=\"G\",'Offerte goederen'!W26,IF(C104=\"M\",'Offerte montage'!Q26,\"\"))","v":""},null,{"$f":"IF(C104=\"G\",'Offerte goederen'!Y26,IF(C104=\"M\",'Offerte montage'!S26,\"\"))","v":""}]
[{"$f":"'Offerte montage'!B27","v":0},{"$f":"IF('Offerte montage'!I27=100,'Offerte montage'!J27,'Offerte montage'!C27)","v":""},"M",{"$f":"IF('Offerte montage'!I27=100,\"\",'Offerte montage'!J27)","v":0},null,{"$f":"IF(C105=\"G\",'Offerte goederen'!R27,IF(C105=\"M\",'Offerte montage'!L27,\"\"))","v":""},{"$f":"IF(C105=\"G\",'Offerte goederen'!S27,IF(C105=\"M\",'Offerte montage'!M27,\"\"))","v":""},null,{"$f":"IF(C105=\"G\",'Offerte goederen'!U27,IF(C105=\"M\",'Offerte montage'!O27,\"\"))","v":0},null,{"$f":"IF(C105=\"G\",'Offerte goederen'!W27,IF(C105=\"M\",'Offerte montage'!Q27,\"\"))","v":""},null,{"$f":"IF(C105=\"G\",'Offerte goederen'!Y27,IF(C105=\"M\",'Offerte montage'!S27,\"\"))","v":""}]
[{"$f":"'Offerte montage'!B28","v":0},{"$f":"IF('Offerte montage'!I28=100,'Offerte montage'!J28,'Offerte montage'!C28)","v":""},"M",{"$f":"IF('Offerte montage'!I28=100,\"\",'Offerte montage'!J28)","v":0},null,{"$f":"IF(C106=\"G\",'Offerte goederen'!R28,IF(C106=\"M\",'Offerte montage'!L28,\"\"))","v":""},{"$f":"IF(C106=\"G\",'Offerte goederen'!S28,IF(C106=\"M\",'Offerte montage'!M28,\"\"))","v":""},null,{"$f":"IF(C106=\"G\",'Offerte goederen'!U28,IF(C106=\"M\",'Offerte montage'!O28,\"\"))","v":0},null,{"$f":"IF(C106=\"G\",'Offerte goederen'!W28,IF(C106=\"M\",'Offerte montage'!Q28,\"\"))","v":""},null,{"$f":"IF(C106=\"G\",'Offerte goederen'!Y28,IF(C106=\"M\",'Offerte montage'!S28,\"\"))","v":""}]
[{"$f":"'Offerte montage'!B29","v":0},{"$f":"IF('Offerte montage'!I29=100,'Offerte montage'!J29,'Offerte montage'!C29)","v":""},"M",{"$f":"IF('Offerte montage'!I29=100,\"\",'Offerte montage'!J29)","v":0},null,{"$f":"IF(C107=\"G\",'Offerte goederen'!R29,IF(C107=\"M\",'Offerte montage'!L29,\"\"))","v":""},{"$f":"IF(C107=\"G\",'Offerte goederen'!S29,IF(C107=\"M\",'Offerte montage'!M29,\"\"))","v":""},null,{"$f":"IF(C107=\"G\",'Offerte goederen'!U29,IF(C107=\"M\",'Offerte montage'!O29,\"\"))","v":0},null,{"$f":"IF(C107=\"G\",'Offerte goederen'!W29,IF(C107=\"M\",'Offerte montage'!Q29,\"\"))","v":""},null,{"$f":"IF(C107=\"G\",'Offerte goederen'!Y29,IF(C107=\"M\",'Offerte montage'!S29,\"\"))","v":""}]
[{"$f":"'Offerte montage'!B30","v":0},{"$f":"IF('Offerte montage'!I30=100,'Offerte montage'!J30,'Offerte montage'!C30)","v":""},"M",{"$f":"IF('Offerte montage'!I30=100,\"\",'Offerte montage'!J30)","v":0},null,{"$f":"IF(C108=\"G\",'Offerte goederen'!R30,IF(C108=\"M\",'Offerte montage'!L30,\"\"))","v":""},{"$f":"IF(C108=\"G\",'Offerte goederen'!S30,IF(C108=\"M\",'Offerte montage'!M30,\"\"))","v":""},null,{"$f":"IF(C108=\"G\",'Offerte goederen'!U30,IF(C108=\"M\",'Offerte montage'!O30,\"\"))","v":0},null,{"$f":"IF(C108=\"G\",'Offerte goederen'!W30,IF(C108=\"M\",'Offerte montage'!Q30,\"\"))","v":""},null,{"$f":"IF(C108=\"G\",'Offerte goederen'!Y30,IF(C108=\"M\",'Offerte montage'!S30,\"\"))","v":""}]
[{"$f":"'Offerte montage'!B31","v":0},{"$f":"IF('Offerte montage'!I31=100,'Offerte montage'!J31,'Offerte montage'!C31)","v":""},"M",{"$f":"IF('Offerte montage'!I31=100,\"\",'Offerte montage'!J31)","v":0},null,{"$f":"IF(C109=\"G\",'Offerte goederen'!R31,IF(C109=\"M\",'Offerte montage'!L31,\"\"))","v":""},{"$f":"IF(C109=\"G\",'Offerte goederen'!S31,IF(C109=\"M\",'Offerte montage'!M31,\"\"))","v":""},null,{"$f":"IF(C109=\"G\",'Offerte goederen'!U31,IF(C109=\"M\",'Offerte montage'!O31,\"\"))","v":0},null,{"$f":"IF(C109=\"G\",'Offerte goederen'!W31,IF(C109=\"M\",'Offerte montage'!Q31,\"\"))","v":""},null,{"$f":"IF(C109=\"G\",'Offerte goederen'!Y31,IF(C109=\"M\",'Offerte montage'!S31,\"\"))","v":""}]
[{"$f":"'Offerte montage'!B32","v":0},{"$f":"IF('Offerte montage'!I32=100,'Offerte montage'!J32,'Offerte montage'!C32)","v":""},"M",{"$f":"IF('Offerte montage'!I32=100,\"\",'Offerte montage'!J32)","v":0},null,{"$f":"IF(C110=\"G\",'Offerte goederen'!R32,IF(C110=\"M\",'Offerte montage'!L32,\"\"))","v":""},{"$f":"IF(C110=\"G\",'Offerte goederen'!S32,IF(C110=\"M\",'Offerte montage'!M32,\"\"))","v":""},null,{"$f":"IF(C110=\"G\",'Offerte goederen'!U32,IF(C110=\"M\",'Offerte montage'!O32,\"\"))","v":0},null,{"$f":"IF(C110=\"G\",'Offerte goederen'!W32,IF(C110=\"M\",'Offerte montage'!Q32,\"\"))","v":""},null,{"$f":"IF(C110=\"G\",'Offerte goederen'!Y32,IF(C110=\"M\",'Offerte montage'!S32,\"\"))","v":""}]
[{"$f":"'Offerte montage'!B33","v":0},{"$f":"IF('Offerte montage'!I33=100,'Offerte montage'!J33,'Offerte montage'!C33)","v":""},"M",{"$f":"IF('Offerte montage'!I33=100,\"\",'Offerte montage'!J33)","v":0},null,{"$f":"IF(C111=\"G\",'Offerte goederen'!R33,IF(C111=\"M\",'Offerte montage'!L33,\"\"))","v":""},{"$f":"IF(C111=\"G\",'Offerte goederen'!S33,IF(C111=\"M\",'Offerte montage'!M33,\"\"))","v":""},null,{"$f":"IF(C111=\"G\",'Offerte goederen'!U33,IF(C111=\"M\",'Offerte montage'!O33,\"\"))","v":0},null,{"$f":"IF(C111=\"G\",'Offerte goederen'!W33,IF(C111=\"M\",'Offerte montage'!Q33,\"\"))","v":""},null,{"$f":"IF(C111=\"G\",'Offerte goederen'!Y33,IF(C111=\"M\",'Offerte montage'!S33,\"\"))","v":""}]
[{"$f":"'Offerte montage'!B34","v":0},{"$f":"IF('Offerte montage'!I34=100,'Offerte montage'!J34,'Offerte montage'!C34)","v":""},"M",{"$f":"IF('Offerte montage'!I34=100,\"\",'Offerte montage'!J34)","v":0},null,{"$f":"IF(C112=\"G\",'Offerte goederen'!R34,IF(C112=\"M\",'Offerte montage'!L34,\"\"))","v":""},{"$f":"IF(C112=\"G\",'Offerte goederen'!S34,IF(C112=\"M\",'Offerte montage'!M34,\"\"))","v":""},null,{"$f":"IF(C112=\"G\",'Offerte goederen'!U34,IF(C112=\"M\",'Offerte montage'!O34,\"\"))","v":0},null,{"$f":"IF(C112=\"G\",'Offerte goederen'!W34,IF(C112=\"M\",'Offerte montage'!Q34,\"\"))","v":""},null,{"$f":"IF(C112=\"G\",'Offerte goederen'!Y34,IF(C112=\"M\",'Offerte montage'!S34,\"\"))","v":""}]
[{"$f":"'Offerte montage'!B35","v":0},{"$f":"IF('Offerte montage'!I35=100,'Offerte montage'!J35,'Offerte montage'!C35)","v":""},"M",{"$f":"IF('Offerte montage'!I35=100,\"\",'Offerte montage'!J35)","v":0},null,{"$f":"IF(C113=\"G\",'Offerte goederen'!R35,IF(C113=\"M\",'Offerte montage'!L35,\"\"))","v":""},{"$f":"IF(C113=\"G\",'Offerte goederen'!S35,IF(C113=\"M\",'Offerte montage'!M35,\"\"))","v":""},null,{"$f":"IF(C113=\"G\",'Offerte goederen'!U35,IF(C113=\"M\",'Offerte montage'!O35,\"\"))","v":0},null,{"$f":"IF(C113=\"G\",'Offerte goederen'!W35,IF(C113=\"M\",'Offerte montage'!Q35,\"\"))","v":""},null,{"$f":"IF(C113=\"G\",'Offerte goederen'!Y35,IF(C113=\"M\",'Offerte montage'!S35,\"\"))","v":""}]
[{"$f":"'Offerte montage'!B36","v":0},{"$f":"IF('Offerte montage'!I36=100,'Offerte montage'!J36,'Offerte montage'!C36)","v":""},"M",{"$f":"IF('Offerte montage'!I36=100,\"\",'Offerte montage'!J36)","v":0},null,{"$f":"IF(C114=\"G\",'Offerte goederen'!R36,IF(C114=\"M\",'Offerte montage'!L36,\"\"))","v":""},{"$f":"IF(C114=\"G\",'Offerte goederen'!S36,IF(C114=\"M\",'Offerte montage'!M36,\"\"))","v":""},null,{"$f":"IF(C114=\"G\",'Offerte goederen'!U36,IF(C114=\"M\",'Offerte montage'!O36,\"\"))","v":0},null,{"$f":"IF(C114=\"G\",'Offerte goederen'!W36,IF(C114=\"M\",'Offerte montage'!Q36,\"\"))","v":""},null,{"$f":"IF(C114=\"G\",'Offerte goederen'!Y36,IF(C114=\"M\",'Offerte montage'!S36,\"\"))","v":""}]
[{"$f":"'Offerte montage'!B37","v":0},{"$f":"IF('Offerte montage'!I37=100,'Offerte montage'!J37,'Offerte montage'!C37)","v":""},"M",{"$f":"IF('Offerte montage'!I37=100,\"\",'Offerte montage'!J37)","v":0},null,{"$f":"IF(C115=\"G\",'Offerte goederen'!R37,IF(C115=\"M\",'Offerte montage'!L37,\"\"))","v":""},{"$f":"IF(C115=\"G\",'Offerte goederen'!S37,IF(C115=\"M\",'Offerte montage'!M37,\"\"))","v":""},null,{"$f":"IF(C115=\"G\",'Offerte goederen'!U37,IF(C115=\"M\",'Offerte montage'!O37,\"\"))","v":0},null,{"$f":"IF(C115=\"G\",'Offerte goederen'!W37,IF(C115=\"M\",'Offerte montage'!Q37,\"\"))","v":""},null,{"$f":"IF(C115=\"G\",'Offerte goederen'!Y37,IF(C115=\"M\",'Offerte montage'!S37,\"\"))","v":""}]
[{"$f":"'Offerte montage'!B38","v":0},{"$f":"IF('Offerte montage'!I38=100,'Offerte montage'!J38,'Offerte montage'!C38)","v":""},"M",{"$f":"IF('Offerte montage'!I38=100,\"\",'Offerte montage'!J38)","v":0},null,{"$f":"IF(C116=\"G\",'Offerte goederen'!R38,IF(C116=\"M\",'Offerte montage'!L38,\"\"))","v":""},{"$f":"IF(C116=\"G\",'Offerte goederen'!S38,IF(C116=\"M\",'Offerte montage'!M38,\"\"))","v":""},null,{"$f":"IF(C116=\"G\",'Offerte goederen'!U38,IF(C116=\"M\",'Offerte montage'!O38,\"\"))","v":0},null,{"$f":"IF(C116=\"G\",'Offerte goederen'!W38,IF(C116=\"M\",'Offerte montage'!Q38,\"\"))","v":""},null,{"$f":"IF(C116=\"G\",'Offerte goederen'!Y38,IF(C116=\"M\",'Offerte montage'!S38,\"\"))","v":""}]
[{"$f":"'Offerte montage'!B39","v":0},{"$f":"IF('Offerte montage'!I39=100,'Offerte montage'!J39,'Offerte montage'!C39)","v":""},"M",{"$f":"IF('Offerte montage'!I39=100,\"\",'Offerte montage'!J39)","v":0},null,{"$f":"IF(C117=\"G\",'Offerte goederen'!R39,IF(C117=\"M\",'Offerte montage'!L39,\"\"))","v":""},{"$f":"IF(C117=\"G\",'Offerte goederen'!S39,IF(C117=\"M\",'Offerte montage'!M39,\"\"))","v":""},null,{"$f":"IF(C117=\"G\",'Offerte goederen'!U39,IF(C117=\"M\",'Offerte montage'!O39,\"\"))","v":0},null,{"$f":"IF(C117=\"G\",'Offerte goederen'!W39,IF(C117=\"M\",'Offerte montage'!Q39,\"\"))","v":""},null,{"$f":"IF(C117=\"G\",'Offerte goederen'!Y39,IF(C117=\"M\",'Offerte montage'!S39,\"\"))","v":""}]
[{"$f":"'Offerte montage'!B40","v":0},{"$f":"IF('Offerte montage'!I40=100,'Offerte montage'!J40,'Offerte montage'!C40)","v":""},"M",{"$f":"IF('Offerte montage'!I40=100,\"\",'Offerte montage'!J40)","v":0},null,{"$f":"IF(C118=\"G\",'Offerte goederen'!R40,IF(C118=\"M\",'Offerte montage'!L40,\"\"))","v":""},{"$f":"IF(C118=\"G\",'Offerte goederen'!S40,IF(C118=\"M\",'Offerte montage'!M40,\"\"))","v":""},null,{"$f":"IF(C118=\"G\",'Offerte goederen'!U40,IF(C118=\"M\",'Offerte montage'!O40,\"\"))","v":0},null,{"$f":"IF(C118=\"G\",'Offerte goederen'!W40,IF(C118=\"M\",'Offerte montage'!Q40,\"\"))","v":""},null,{"$f":"IF(C118=\"G\",'Offerte goederen'!Y40,IF(C118=\"M\",'Offerte montage'!S40,\"\"))","v":""}]
[{"$f":"'Offerte montage'!B41","v":0},{"$f":"IF('Offerte montage'!I41=100,'Offerte montage'!J41,'Offerte montage'!C41)","v":""},"M",{"$f":"IF('Offerte montage'!I41=100,\"\",'Offerte montage'!J41)","v":0},null,{"$f":"IF(C119=\"G\",'Offerte goederen'!R41,IF(C119=\"M\",'Offerte montage'!L41,\"\"))","v":""},{"$f":"IF(C119=\"G\",'Offerte goederen'!S41,IF(C119=\"M\",'Offerte montage'!M41,\"\"))","v":""},null,{"$f":"IF(C119=\"G\",'Offerte goederen'!U41,IF(C119=\"M\",'Offerte montage'!O41,\"\"))","v":0},null,{"$f":"IF(C119=\"G\",'Offerte goederen'!W41,IF(C119=\"M\",'Offerte montage'!Q41,\"\"))","v":""},null,{"$f":"IF(C119=\"G\",'Offerte goederen'!Y41,IF(C119=\"M\",'Offerte montage'!S41,\"\"))","v":""}]
[{"$f":"'Offerte montage'!B42","v":0},{"$f":"IF('Offerte montage'!I42=100,'Offerte montage'!J42,'Offerte montage'!C42)","v":""},"M",{"$f":"IF('Offerte montage'!I42=100,\"\",'Offerte montage'!J42)","v":0},null,{"$f":"IF(C120=\"G\",'Offerte goederen'!R42,IF(C120=\"M\",'Offerte montage'!L42,\"\"))","v":""},{"$f":"IF(C120=\"G\",'Offerte goederen'!S42,IF(C120=\"M\",'Offerte montage'!M42,\"\"))","v":""},null,{"$f":"IF(C120=\"G\",'Offerte goederen'!U42,IF(C120=\"M\",'Offerte montage'!O42,\"\"))","v":0},null,{"$f":"IF(C120=\"G\",'Offerte goederen'!W42,IF(C120=\"M\",'Offerte montage'!Q42,\"\"))","v":""},null,{"$f":"IF(C120=\"G\",'Offerte goederen'!Y42,IF(C120=\"M\",'Offerte montage'!S42,\"\"))","v":""}]
[{"$f":"'Offerte montage'!B43","v":0},{"$f":"IF('Offerte montage'!I43=100,'Offerte montage'!J43,'Offerte montage'!C43)","v":""},"M",{"$f":"IF('Offerte montage'!I43=100,\"\",'Offerte montage'!J43)","v":0},null,{"$f":"IF(C121=\"G\",'Offerte goederen'!R43,IF(C121=\"M\",'Offerte montage'!L43,\"\"))","v":""},{"$f":"IF(C121=\"G\",'Offerte goederen'!S43,IF(C121=\"M\",'Offerte montage'!M43,\"\"))","v":""},null,{"$f":"IF(C121=\"G\",'Offerte goederen'!U43,IF(C121=\"M\",'Offerte montage'!O43,\"\"))","v":0},null,{"$f":"IF(C121=\"G\",'Offerte goederen'!W43,IF(C121=\"M\",'Offerte montage'!Q43,\"\"))","v":""},null,{"$f":"IF(C121=\"G\",'Offerte goederen'!Y43,IF(C121=\"M\",'Offerte montage'!S43,\"\"))","v":""}]
[{"$f":"'Offerte montage'!B44","v":0},{"$f":"IF('Offerte montage'!I44=100,'Offerte montage'!J44,'Offerte montage'!C44)","v":""},"M",{"$f":"IF('Offerte montage'!I44=100,\"\",'Offerte montage'!J44)","v":0},null,{"$f":"IF(C122=\"G\",'Offerte goederen'!R44,IF(C122=\"M\",'Offerte montage'!L44,\"\"))","v":""},{"$f":"IF(C122=\"G\",'Offerte goederen'!S44,IF(C122=\"M\",'Offerte montage'!M44,\"\"))","v":""},null,{"$f":"IF(C122=\"G\",'Offerte goederen'!U44,IF(C122=\"M\",'Offerte montage'!O44,\"\"))","v":0},null,{"$f":"IF(C122=\"G\",'Offerte goederen'!W44,IF(C122=\"M\",'Offerte montage'!Q44,\"\"))","v":""},null,{"$f":"IF(C122=\"G\",'Offerte goederen'!Y44,IF(C122=\"M\",'Offerte montage'!S44,\"\"))","v":""}]
[{"$f":"'Offerte montage'!B45","v":0},{"$f":"IF('Offerte montage'!I45=100,'Offerte montage'!J45,'Offerte montage'!C45)","v":""},"M",{"$f":"IF('Offerte montage'!I45=100,\"\",'Offerte montage'!J45)","v":0},null,{"$f":"IF(C123=\"G\",'Offerte goederen'!R45,IF(C123=\"M\",'Offerte montage'!L45,\"\"))","v":""},{"$f":"IF(C123=\"G\",'Offerte goederen'!S45,IF(C123=\"M\",'Offerte montage'!M45,\"\"))","v":""},null,{"$f":"IF(C123=\"G\",'Offerte goederen'!U45,IF(C123=\"M\",'Offerte montage'!O45,\"\"))","v":0},null,{"$f":"IF(C123=\"G\",'Offerte goederen'!W45,IF(C123=\"M\",'Offerte montage'!Q45,\"\"))","v":""},null,{"$f":"IF(C123=\"G\",'Offerte goederen'!Y45,IF(C123=\"M\",'Offerte montage'!S45,\"\"))","v":""}]
[{"$f":"'Offerte montage'!B46","v":0},{"$f":"IF('Offerte montage'!I46=100,'Offerte montage'!J46,'Offerte montage'!C46)","v":""},"M",{"$f":"IF('Offerte montage'!I46=100,\"\",'Offerte montage'!J46)","v":0},null,{"$f":"IF(C124=\"G\",'Offerte goederen'!R46,IF(C124=\"M\",'Offerte montage'!L46,\"\"))","v":""},{"$f":"IF(C124=\"G\",'Offerte goederen'!S46,IF(C124=\"M\",'Offerte montage'!M46,\"\"))","v":""},null,{"$f":"IF(C124=\"G\",'Offerte goederen'!U46,IF(C124=\"M\",'Offerte montage'!O46,\"\"))","v":0},null,{"$f":"IF(C124=\"G\",'Offerte goederen'!W46,IF(C124=\"M\",'Offerte montage'!Q46,\"\"))","v":""},null,{"$f":"IF(C124=\"G\",'Offerte goederen'!Y46,IF(C124=\"M\",'Offerte montage'!S46,\"\"))","v":""}]
[{"$f":"'Offerte montage'!B47","v":0},{"$f":"IF('Offerte montage'!I47=100,'Offerte montage'!J47,'Offerte montage'!C47)","v":""},"M",{"$f":"IF('Offerte montage'!I47=100,\"\",'Offerte montage'!J47)","v":0},null,{"$f":"IF(C125=\"G\",'Offerte goederen'!R47,IF(C125=\"M\",'Offerte montage'!L47,\"\"))","v":""},{"$f":"IF(C125=\"G\",'Offerte goederen'!S47,IF(C125=\"M\",'Offerte montage'!M47,\"\"))","v":""},null,{"$f":"IF(C125=\"G\",'Offerte goederen'!U47,IF(C125=\"M\",'Offerte montage'!O47,\"\"))","v":0},null,{"$f":"IF(C125=\"G\",'Offerte goederen'!W47,IF(C125=\"M\",'Offerte montage'!Q47,\"\"))","v":""},null,{"$f":"IF(C125=\"G\",'Offerte goederen'!Y47,IF(C125=\"M\",'Offerte montage'!S47,\"\"))","v":""}]
[{"$f":"'Offerte montage'!B48","v":0},{"$f":"IF('Offerte montage'!I48=100,'Offerte montage'!J48,'Offerte montage'!C48)","v":""},"M",{"$f":"IF('Offerte montage'!I48=100,\"\",'Offerte montage'!J48)","v":0},null,{"$f":"IF(C126=\"G\",'Offerte goederen'!R48,IF(C126=\"M\",'Offerte montage'!L48,\"\"))","v":""},{"$f":"IF(C126=\"G\",'Offerte goederen'!S48,IF(C126=\"M\",'Offerte montage'!M48,\"\"))","v":""},null,{"$f":"IF(C126=\"G\",'Offerte goederen'!U48,IF(C126=\"M\",'Offerte montage'!O48,\"\"))","v":0},null,{"$f":"IF(C126=\"G\",'Offerte goederen'!W48,IF(C126=\"M\",'Offerte montage'!Q48,\"\"))","v":""},null,{"$f":"IF(C126=\"G\",'Offerte goederen'!Y48,IF(C126=\"M\",'Offerte montage'!S48,\"\"))","v":""}]
[{"$f":"'Offerte montage'!B49","v":0},{"$f":"IF('Offerte montage'!I49=100,'Offerte montage'!J49,'Offerte montage'!C49)","v":""},"M",{"$f":"IF('Offerte montage'!I49=100,\"\",'Offerte montage'!J49)","v":0},null,{"$f":"IF(C127=\"G\",'Offerte goederen'!R49,IF(C127=\"M\",'Offerte montage'!L49,\"\"))","v":""},{"$f":"IF(C127=\"G\",'Offerte goederen'!S49,IF(C127=\"M\",'Offerte montage'!M49,\"\"))","v":""},null,{"$f":"IF(C127=\"G\",'Offerte goederen'!U49,IF(C127=\"M\",'Offerte montage'!O49,\"\"))","v":0},null,{"$f":"IF(C127=\"G\",'Offerte goederen'!W49,IF(C127=\"M\",'Offerte montage'!Q49,\"\"))","v":""},null,{"$f":"IF(C127=\"G\",'Offerte goederen'!Y49,IF(C127=\"M\",'Offerte montage'!S49,\"\"))","v":""}]
[{"$f":"'Offerte montage'!B50","v":0},{"$f":"IF('Offerte montage'!I50=100,'Offerte montage'!J50,'Offerte montage'!C50)","v":""},"M",{"$f":"IF('Offerte montage'!I50=100,\"\",'Offerte montage'!J50)","v":0},null,{"$f":"IF(C128=\"G\",'Offerte goederen'!R50,IF(C128=\"M\",'Offerte montage'!L50,\"\"))","v":""},{"$f":"IF(C128=\"G\",'Offerte goederen'!S50,IF(C128=\"M\",'Offerte montage'!M50,\"\"))","v":""},null,{"$f":"IF(C128=\"G\",'Offerte goederen'!U50,IF(C128=\"M\",'Offerte montage'!O50,\"\"))","v":0},null,{"$f":"IF(C128=\"G\",'Offerte goederen'!W50,IF(C128=\"M\",'Offerte montage'!Q50,\"\"))","v":""},null,{"$f":"IF(C128=\"G\",'Offerte goederen'!Y50,IF(C128=\"M\",'Offerte montage'!S50,\"\"))","v":""}]
[{"$f":"'Offerte montage'!B51","v":0},{"$f":"IF('Offerte montage'!I51=100,'Offerte montage'!J51,'Offerte montage'!C51)","v":""},"M",{"$f":"IF('Offerte montage'!I51=100,\"\",'Offerte montage'!J51)","v":0},null,{"$f":"IF(C129=\"G\",'Offerte goederen'!R51,IF(C129=\"M\",'Offerte montage'!L51,\"\"))","v":""},{"$f":"IF(C129=\"G\",'Offerte goederen'!S51,IF(C129=\"M\",'Offerte montage'!M51,\"\"))","v":""},null,{"$f":"IF(C129=\"G\",'Offerte goederen'!U51,IF(C129=\"M\",'Offerte montage'!O51,\"\"))","v":0},null,{"$f":"IF(C129=\"G\",'Offerte goederen'!W51,IF(C129=\"M\",'Offerte montage'!Q51,\"\"))","v":""},null,{"$f":"IF(C129=\"G\",'Offerte goederen'!Y51,IF(C129=\"M\",'Offerte montage'!S51,\"\"))","v":""}]
[{"$f":"'Offerte montage'!B52","v":0},{"$f":"IF('Offerte montage'!I52=100,'Offerte montage'!J52,'Offerte montage'!C52)","v":""},"M",{"$f":"IF('Offerte montage'!I52=100,\"\",'Offerte montage'!J52)","v":0},null,{"$f":"IF(C130=\"G\",'Offerte goederen'!R52,IF(C130=\"M\",'Offerte montage'!L52,\"\"))","v":""},{"$f":"IF(C130=\"G\",'Offerte goederen'!S52,IF(C130=\"M\",'Offerte montage'!M52,\"\"))","v":""},null,{"$f":"IF(C130=\"G\",'Offerte goederen'!U52,IF(C130=\"M\",'Offerte montage'!O52,\"\"))","v":0},null,{"$f":"IF(C130=\"G\",'Offerte goederen'!W52,IF(C130=\"M\",'Offerte montage'!Q52,\"\"))","v":""},null,{"$f":"IF(C130=\"G\",'Offerte goederen'!Y52,IF(C130=\"M\",'Offerte montage'!S52,\"\"))","v":""}]
[{"$f":"'Offerte montage'!B53","v":0},{"$f":"IF('Offerte montage'!I53=100,'Offerte montage'!J53,'Offerte montage'!C53)","v":""},"M",{"$f":"IF('Offerte montage'!I53=100,\"\",'Offerte montage'!J53)","v":0},null,{"$f":"IF(C131=\"G\",'Offerte goederen'!R53,IF(C131=\"M\",'Offerte montage'!L53,\"\"))","v":""},{"$f":"IF(C131=\"G\",'Offerte goederen'!S53,IF(C131=\"M\",'Offerte montage'!M53,\"\"))","v":""},null,{"$f":"IF(C131=\"G\",'Offerte goederen'!U53,IF(C131=\"M\",'Offerte montage'!O53,\"\"))","v":0},null,{"$f":"IF(C131=\"G\",'Offerte goederen'!W53,IF(C131=\"M\",'Offerte montage'!Q53,\"\"))","v":""},null,{"$f":"IF(C131=\"G\",'Offerte goederen'!Y53,IF(C131=\"M\",'Offerte montage'!S53,\"\"))","v":""}]
[{"$f":"'Offerte montage'!B54","v":0},{"$f":"IF('Offerte montage'!I54=100,'Offerte montage'!J54,'Offerte montage'!C54)","v":""},"M",{"$f":"IF('Offerte montage'!I54=100,\"\",'Offerte montage'!J54)","v":0},null,{"$f":"IF(C132=\"G\",'Offerte goederen'!R54,IF(C132=\"M\",'Offerte montage'!L54,\"\"))","v":""},{"$f":"IF(C132=\"G\",'Offerte goederen'!S54,IF(C132=\"M\",'Offerte montage'!M54,\"\"))","v":""},null,{"$f":"IF(C132=\"G\",'Offerte goederen'!U54,IF(C132=\"M\",'Offerte montage'!O54,\"\"))","v":0},null,{"$f":"IF(C132=\"G\",'Offerte goederen'!W54,IF(C132=\"M\",'Offerte montage'!Q54,\"\"))","v":""},null,{"$f":"IF(C132=\"G\",'Offerte goederen'!Y54,IF(C132=\"M\",'Offerte montage'!S54,\"\"))","v":""}]
[{"$f":"'Offerte montage'!B55","v":0},{"$f":"IF('Offerte montage'!I55=100,'Offerte montage'!J55,'Offerte montage'!C55)","v":""},"M",{"$f":"IF('Offerte montage'!I55=100,\"\",'Offerte montage'!J55)","v":0},null,{"$f":"IF(C133=\"G\",'Offerte goederen'!R55,IF(C133=\"M\",'Offerte montage'!L55,\"\"))","v":""},{"$f":"IF(C133=\"G\",'Offerte goederen'!S55,IF(C133=\"M\",'Offerte montage'!M55,\"\"))","v":""},null,{"$f":"IF(C133=\"G\",'Offerte goederen'!U55,IF(C133=\"M\",'Offerte montage'!O55,\"\"))","v":0},null,{"$f":"IF(C133=\"G\",'Offerte goederen'!W55,IF(C133=\"M\",'Offerte montage'!Q55,\"\"))","v":""},null,{"$f":"IF(C133=\"G\",'Offerte goederen'!Y55,IF(C133=\"M\",'Offerte montage'!S55,\"\"))","v":""}]
[{"$f":"'Offerte montage'!B56","v":0},{"$f":"IF('Offerte montage'!I56=100,'Offerte montage'!J56,'Offerte montage'!C56)","v":""},"M",{"$f":"IF('Offerte montage'!I56=100,\"\",'Offerte montage'!J56)","v":0},null,{"$f":"IF(C134=\"G\",'Offerte goederen'!R56,IF(C134=\"M\",'Offerte montage'!L56,\"\"))","v":""},{"$f":"IF(C134=\"G\",'Offerte goederen'!S56,IF(C134=\"M\",'Offerte montage'!M56,\"\"))","v":""},null,{"$f":"IF(C134=\"G\",'Offerte goederen'!U56,IF(C134=\"M\",'Offerte montage'!O56,\"\"))","v":0},null,{"$f":"IF(C134=\"G\",'Offerte goederen'!W56,IF(C134=\"M\",'Offerte montage'!Q56,\"\"))","v":""},null,{"$f":"IF(C134=\"G\",'Offerte goederen'!Y56,IF(C134=\"M\",'Offerte montage'!S56,\"\"))","v":""}]
[{"$f":"'Offerte montage'!B57","v":0},{"$f":"IF('Offerte montage'!I57=100,'Offerte montage'!J57,'Offerte montage'!C57)","v":""},"M",{"$f":"IF('Offerte montage'!I57=100,\"\",'Offerte montage'!J57)","v":0},null,{"$f":"IF(C135=\"G\",'Offerte goederen'!R57,IF(C135=\"M\",'Offerte montage'!L57,\"\"))","v":""},{"$f":"IF(C135=\"G\",'Offerte goederen'!S57,IF(C135=\"M\",'Offerte montage'!M57,\"\"))","v":""},null,{"$f":"IF(C135=\"G\",'Offerte goederen'!U57,IF(C135=\"M\",'Offerte montage'!O57,\"\"))","v":0},null,{"$f":"IF(C135=\"G\",'Offerte goederen'!W57,IF(C135=\"M\",'Offerte montage'!Q57,\"\"))","v":""},null,{"$f":"IF(C135=\"G\",'Offerte goederen'!Y57,IF(C135=\"M\",'Offerte montage'!S57,\"\"))","v":""}]
[{"$f":"'Offerte montage'!B58","v":0},{"$f":"IF('Offerte montage'!I58=100,'Offerte montage'!J58,'Offerte montage'!C58)","v":""},"M",{"$f":"IF('Offerte montage'!I58=100,\"\",'Offerte montage'!J58)","v":0},null,{"$f":"IF(C136=\"G\",'Offerte goederen'!R58,IF(C136=\"M\",'Offerte montage'!L58,\"\"))","v":""},{"$f":"IF(C136=\"G\",'Offerte goederen'!S58,IF(C136=\"M\",'Offerte montage'!M58,\"\"))","v":""},null,{"$f":"IF(C136=\"G\",'Offerte goederen'!U58,IF(C136=\"M\",'Offerte montage'!O58,\"\"))","v":0},null,{"$f":"IF(C136=\"G\",'Offerte goederen'!W58,IF(C136=\"M\",'Offerte montage'!Q58,\"\"))","v":""},null,{"$f":"IF(C136=\"G\",'Offerte goederen'!Y58,IF(C136=\"M\",'Offerte montage'!S58,\"\"))","v":""}]
[{"$f":"'Offerte montage'!B59","v":0},{"$f":"IF('Offerte montage'!I59=100,'Offerte montage'!J59,'Offerte montage'!C59)","v":""},"M",{"$f":"IF('Offerte montage'!I59=100,\"\",'Offerte montage'!J59)","v":0},null,{"$f":"IF(C137=\"G\",'Offerte goederen'!R59,IF(C137=\"M\",'Offerte montage'!L59,\"\"))","v":""},{"$f":"IF(C137=\"G\",'Offerte goederen'!S59,IF(C137=\"M\",'Offerte montage'!M59,\"\"))","v":""},null,{"$f":"IF(C137=\"G\",'Offerte goederen'!U59,IF(C137=\"M\",'Offerte montage'!O59,\"\"))","v":0},null,{"$f":"IF(C137=\"G\",'Offerte goederen'!W59,IF(C137=\"M\",'Offerte montage'!Q59,\"\"))","v":""},null,{"$f":"IF(C137=\"G\",'Offerte goederen'!Y59,IF(C137=\"M\",'Offerte montage'!S59,\"\"))","v":""}]
[{"$f":"'Offerte montage'!B60","v":0},{"$f":"IF('Offerte montage'!I60=100,'Offerte montage'!J60,'Offerte montage'!C60)","v":""},"M",{"$f":"IF('Offerte montage'!I60=100,\"\",'Offerte montage'!J60)","v":0},null,{"$f":"IF(C138=\"G\",'Offerte goederen'!R60,IF(C138=\"M\",'Offerte montage'!L60,\"\"))","v":""},{"$f":"IF(C138=\"G\",'Offerte goederen'!S60,IF(C138=\"M\",'Offerte montage'!M60,\"\"))","v":""},null,{"$f":"IF(C138=\"G\",'Offerte goederen'!U60,IF(C138=\"M\",'Offerte montage'!O60,\"\"))","v":0},null,{"$f":"IF(C138=\"G\",'Offerte goederen'!W60,IF(C138=\"M\",'Offerte montage'!Q60,\"\"))","v":""},null,{"$f":"IF(C138=\"G\",'Offerte goederen'!Y60,IF(C138=\"M\",'Offerte montage'!S60,\"\"))","v":""}]
[{"$f":"'Offerte montage'!B61","v":0},{"$f":"IF('Offerte montage'!I61=100,'Offerte montage'!J61,'Offerte montage'!C61)","v":""},"M",{"$f":"IF('Offerte montage'!I61=100,\"\",'Offerte montage'!J61)","v":0},null,{"$f":"IF(C139=\"G\",'Offerte goederen'!R61,IF(C139=\"M\",'Offerte montage'!L61,\"\"))","v":""},{"$f":"IF(C139=\"G\",'Offerte goederen'!S61,IF(C139=\"M\",'Offerte montage'!M61,\"\"))","v":""},null,{"$f":"IF(C139=\"G\",'Offerte goederen'!U61,IF(C139=\"M\",'Offerte montage'!O61,\"\"))","v":0},null,{"$f":"IF(C139=\"G\",'Offerte goederen'!W61,IF(C139=\"M\",'Offerte montage'!Q61,\"\"))","v":""},null,{"$f":"IF(C139=\"G\",'Offerte goederen'!Y61,IF(C139=\"M\",'Offerte montage'!S61,\"\"))","v":""}]
[{"$f":"'Offerte montage'!B62","v":0},{"$f":"IF('Offerte montage'!I62=100,'Offerte montage'!J62,'Offerte montage'!C62)","v":""},"M",{"$f":"IF('Offerte montage'!I62=100,\"\",'Offerte montage'!J62)","v":0},null,{"$f":"IF(C140=\"G\",'Offerte goederen'!R62,IF(C140=\"M\",'Offerte montage'!L62,\"\"))","v":""},{"$f":"IF(C140=\"G\",'Offerte goederen'!S62,IF(C140=\"M\",'Offerte montage'!M62,\"\"))","v":""},null,{"$f":"IF(C140=\"G\",'Offerte goederen'!U62,IF(C140=\"M\",'Offerte montage'!O62,\"\"))","v":0},null,{"$f":"IF(C140=\"G\",'Offerte goederen'!W62,IF(C140=\"M\",'Offerte montage'!Q62,\"\"))","v":""},null,{"$f":"IF(C140=\"G\",'Offerte goederen'!Y62,IF(C140=\"M\",'Offerte montage'!S62,\"\"))","v":""}]
[{"$f":"'Offerte montage'!B63","v":0},{"$f":"IF('Offerte montage'!I63=100,'Offerte montage'!J63,'Offerte montage'!C63)","v":""},"M",{"$f":"IF('Offerte montage'!I63=100,\"\",'Offerte montage'!J63)","v":0},null,{"$f":"IF(C141=\"G\",'Offerte goederen'!R63,IF(C141=\"M\",'Offerte montage'!L63,\"\"))","v":""},{"$f":"IF(C141=\"G\",'Offerte goederen'!S63,IF(C141=\"M\",'Offerte montage'!M63,\"\"))","v":""},null,{"$f":"IF(C141=\"G\",'Offerte goederen'!U63,IF(C141=\"M\",'Offerte montage'!O63,\"\"))","v":0},null,{"$f":"IF(C141=\"G\",'Offerte goederen'!W63,IF(C141=\"M\",'Offerte montage'!Q63,\"\"))","v":""},null,{"$f":"IF(C141=\"G\",'Offerte goederen'!Y63,IF(C141=\"M\",'Offerte montage'!S63,\"\"))","v":""}]
[{"$f":"'Offerte montage'!B64","v":0},{"$f":"IF('Offerte montage'!I64=100,'Offerte montage'!J64,'Offerte montage'!C64)","v":""},"M",{"$f":"IF('Offerte montage'!I64=100,\"\",'Offerte montage'!J64)","v":0},null,{"$f":"IF(C142=\"G\",'Offerte goederen'!R64,IF(C142=\"M\",'Offerte montage'!L64,\"\"))","v":""},{"$f":"IF(C142=\"G\",'Offerte goederen'!S64,IF(C142=\"M\",'Offerte montage'!M64,\"\"))","v":""},null,{"$f":"IF(C142=\"G\",'Offerte goederen'!U64,IF(C142=\"M\",'Offerte montage'!O64,\"\"))","v":0},null,{"$f":"IF(C142=\"G\",'Offerte goederen'!W64,IF(C142=\"M\",'Offerte montage'!Q64,\"\"))","v":""},null,{"$f":"IF(C142=\"G\",'Offerte goederen'!Y64,IF(C142=\"M\",'Offerte montage'!S64,\"\"))","v":""}]
[{"$f":"'Offerte montage'!B65","v":0},{"$f":"IF('Offerte montage'!I65=100,'Offerte montage'!J65,'Offerte montage'!C65)","v":""},"M",{"$f":"IF('Offerte montage'!I65=100,\"\",'Offerte montage'!J65)","v":0},null,{"$f":"IF(C143=\"G\",'Offerte goederen'!R65,IF(C143=\"M\",'Offerte montage'!L65,\"\"))","v":""},{"$f":"IF(C143=\"G\",'Offerte goederen'!S65,IF(C143=\"M\",'Offerte montage'!M65,\"\"))","v":""},null,{"$f":"IF(C143=\"G\",'Offerte goederen'!U65,IF(C143=\"M\",'Offerte montage'!O65,\"\"))","v":0},null,{"$f":"IF(C143=\"G\",'Offerte goederen'!W65,IF(C143=\"M\",'Offerte montage'!Q65,\"\"))","v":""},null,{"$f":"IF(C143=\"G\",'Offerte goederen'!Y65,IF(C143=\"M\",'Offerte montage'!S65,\"\"))","v":""}]
[{"$f":"'Offerte montage'!B66","v":0},{"$f":"IF('Offerte montage'!I66=100,'Offerte montage'!J66,'Offerte montage'!C66)","v":""},"M",{"$f":"IF('Offerte montage'!I66=100,\"\",'Offerte montage'!J66)","v":0},null,{"$f":"IF(C144=\"G\",'Offerte goederen'!R66,IF(C144=\"M\",'Offerte montage'!L66,\"\"))","v":""},{"$f":"IF(C144=\"G\",'Offerte goederen'!S66,IF(C144=\"M\",'Offerte montage'!M66,\"\"))","v":""},null,{"$f":"IF(C144=\"G\",'Offerte goederen'!U66,IF(C144=\"M\",'Offerte montage'!O66,\"\"))","v":0},null,{"$f":"IF(C144=\"G\",'Offerte goederen'!W66,IF(C144=\"M\",'Offerte montage'!Q66,\"\"))","v":""},null,{"$f":"IF(C144=\"G\",'Offerte goederen'!Y66,IF(C144=\"M\",'Offerte montage'!S66,\"\"))","v":""}]
[{"$f":"'Offerte montage'!B67","v":0},{"$f":"IF('Offerte montage'!I67=100,'Offerte montage'!J67,'Offerte montage'!C67)","v":""},"M",{"$f":"IF('Offerte montage'!I67=100,\"\",'Offerte montage'!J67)","v":0},null,{"$f":"IF(C145=\"G\",'Offerte goederen'!R67,IF(C145=\"M\",'Offerte montage'!L67,\"\"))","v":""},{"$f":"IF(C145=\"G\",'Offerte goederen'!S67,IF(C145=\"M\",'Offerte montage'!M67,\"\"))","v":""},null,{"$f":"IF(C145=\"G\",'Offerte goederen'!U67,IF(C145=\"M\",'Offerte montage'!O67,\"\"))","v":0},null,{"$f":"IF(C145=\"G\",'Offerte goederen'!W67,IF(C145=\"M\",'Offerte montage'!Q67,\"\"))","v":""},null,{"$f":"IF(C145=\"G\",'Offerte goederen'!Y67,IF(C145=\"M\",'Offerte montage'!S67,\"\"))","v":""}]
[{"$f":"'Offerte montage'!B68","v":0},{"$f":"IF('Offerte montage'!I68=100,'Offerte montage'!J68,'Offerte montage'!C68)","v":""},"M",{"$f":"IF('Offerte montage'!I68=100,\"\",'Offerte montage'!J68)","v":0},null,{"$f":"IF(C146=\"G\",'Offerte goederen'!R68,IF(C146=\"M\",'Offerte montage'!L68,\"\"))","v":""},{"$f":"IF(C146=\"G\",'Offerte goederen'!S68,IF(C146=\"M\",'Offerte montage'!M68,\"\"))","v":""},null,{"$f":"IF(C146=\"G\",'Offerte goederen'!U68,IF(C146=\"M\",'Offerte montage'!O68,\"\"))","v":0},null,{"$f":"IF(C146=\"G\",'Offerte goederen'!W68,IF(C146=\"M\",'Offerte montage'!Q68,\"\"))","v":""},null,{"$f":"IF(C146=\"G\",'Offerte goederen'!Y68,IF(C146=\"M\",'Offerte montage'!S68,\"\"))","v":""}]
[{"$f":"'Offerte montage'!B69","v":0},{"$f":"IF('Offerte montage'!I69=100,'Offerte montage'!J69,'Offerte montage'!C69)","v":""},"M",{"$f":"IF('Offerte montage'!I69=100,\"\",'Offerte montage'!J69)","v":0},null,{"$f":"IF(C147=\"G\",'Offerte goederen'!R69,IF(C147=\"M\",'Offerte montage'!L69,\"\"))","v":""},{"$f":"IF(C147=\"G\",'Offerte goederen'!S69,IF(C147=\"M\",'Offerte montage'!M69,\"\"))","v":""},null,{"$f":"IF(C147=\"G\",'Offerte goederen'!U69,IF(C147=\"M\",'Offerte montage'!O69,\"\"))","v":0},null,{"$f":"IF(C147=\"G\",'Offerte goederen'!W69,IF(C147=\"M\",'Offerte montage'!Q69,\"\"))","v":""},null,{"$f":"IF(C147=\"G\",'Offerte goederen'!Y69,IF(C147=\"M\",'Offerte montage'!S69,\"\"))","v":""}]
[{"$f":"'Offerte montage'!B70","v":0},{"$f":"IF('Offerte montage'!I70=100,'Offerte montage'!J70,'Offerte montage'!C70)","v":""},"M",{"$f":"IF('Offerte montage'!I70=100,\"\",'Offerte montage'!J70)","v":0},null,{"$f":"IF(C148=\"G\",'Offerte goederen'!R70,IF(C148=\"M\",'Offerte montage'!L70,\"\"))","v":""},{"$f":"IF(C148=\"G\",'Offerte goederen'!S70,IF(C148=\"M\",'Offerte montage'!M70,\"\"))","v":""},null,{"$f":"IF(C148=\"G\",'Offerte goederen'!U70,IF(C148=\"M\",'Offerte montage'!O70,\"\"))","v":0},null,{"$f":"IF(C148=\"G\",'Offerte goederen'!W70,IF(C148=\"M\",'Offerte montage'!Q70,\"\"))","v":""},null,{"$f":"IF(C148=\"G\",'Offerte goederen'!Y70,IF(C148=\"M\",'Offerte montage'!S70,\"\"))","v":""}]
[{"$f":"'Offerte montage'!B71","v":0},{"$f":"IF('Offerte montage'!I71=100,'Offerte montage'!J71,'Offerte montage'!C71)","v":""},"M",{"$f":"IF('Offerte montage'!I71=100,\"\",'Offerte montage'!J71)","v":0},null,{"$f":"IF(C149=\"G\",'Offerte goederen'!R71,IF(C149=\"M\",'Offerte montage'!L71,\"\"))","v":""},{"$f":"IF(C149=\"G\",'Offerte goederen'!S71,IF(C149=\"M\",'Offerte montage'!M71,\"\"))","v":""},null,{"$f":"IF(C149=\"G\",'Offerte goederen'!U71,IF(C149=\"M\",'Offerte montage'!O71,\"\"))","v":0},null,{"$f":"IF(C149=\"G\",'Offerte goederen'!W71,IF(C149=\"M\",'Offerte montage'!Q71,\"\"))","v":""},null,{"$f":"IF(C149=\"G\",'Offerte goederen'!Y71,IF(C149=\"M\",'Offerte montage'!S71,\"\"))","v":""}]
[{"$f":"'Offerte montage'!B72","v":0},{"$f":"IF('Offerte montage'!I72=100,'Offerte montage'!J72,'Offerte montage'!C72)","v":""},"M",{"$f":"IF('Offerte montage'!I72=100,\"\",'Offerte montage'!J72)","v":0},null,{"$f":"IF(C150=\"G\",'Offerte goederen'!R72,IF(C150=\"M\",'Offerte montage'!L72,\"\"))","v":""},{"$f":"IF(C150=\"G\",'Offerte goederen'!S72,IF(C150=\"M\",'Offerte montage'!M72,\"\"))","v":""},null,{"$f":"IF(C150=\"G\",'Offerte goederen'!U72,IF(C150=\"M\",'Offerte montage'!O72,\"\"))","v":0},null,{"$f":"IF(C150=\"G\",'Offerte goederen'!W72,IF(C150=\"M\",'Offerte montage'!Q72,\"\"))","v":""},null,{"$f":"IF(C150=\"G\",'Offerte goederen'!Y72,IF(C150=\"M\",'Offerte montage'!S72,\"\"))","v":""}]
[{"$f":"'Offerte montage'!B73","v":0},{"$f":"IF('Offerte montage'!I73=100,'Offerte montage'!J73,'Offerte montage'!C73)","v":""},"M",{"$f":"IF('Offerte montage'!I73=100,\"\",'Offerte montage'!J73)","v":0},null,{"$f":"IF(C151=\"G\",'Offerte goederen'!R73,IF(C151=\"M\",'Offerte montage'!L73,\"\"))","v":""},{"$f":"IF(C151=\"G\",'Offerte goederen'!S73,IF(C151=\"M\",'Offerte montage'!M73,\"\"))","v":""},null,{"$f":"IF(C151=\"G\",'Offerte goederen'!U73,IF(C151=\"M\",'Offerte montage'!O73,\"\"))","v":0},null,{"$f":"IF(C151=\"G\",'Offerte goederen'!W73,IF(C151=\"M\",'Offerte montage'!Q73,\"\"))","v":""},null,{"$f":"IF(C151=\"G\",'Offerte goederen'!Y73,IF(C151=\"M\",'Offerte montage'!S73,\"\"))","v":""}]
[{"$f":"'Offerte montage'!B74","v":0},{"$f":"IF('Offerte montage'!I74=100,'Offerte montage'!J74,'Offerte montage'!C74)","v":""},"M",{"$f":"IF('Offerte montage'!I74=100,\"\",'Offerte montage'!J74)","v":0},null,{"$f":"IF(C152=\"G\",'Offerte goederen'!R74,IF(C152=\"M\",'Offerte montage'!L74,\"\"))","v":""},{"$f":"IF(C152=\"G\",'Offerte goederen'!S74,IF(C152=\"M\",'Offerte montage'!M74,\"\"))","v":""},null,{"$f":"IF(C152=\"G\",'Offerte goederen'!U74,IF(C152=\"M\",'Offerte montage'!O74,\"\"))","v":0},null,{"$f":"IF(C152=\"G\",'Offerte goederen'!W74,IF(C152=\"M\",'Offerte montage'!Q74,\"\"))","v":""},null,{"$f":"IF(C152=\"G\",'Offerte goederen'!Y74,IF(C152=\"M\",'Offerte montage'!S74,\"\"))","v":""}]
[{"$f":"'Offerte montage'!B75","v":0},{"$f":"IF('Offerte montage'!I75=100,'Offerte montage'!J75,'Offerte montage'!C75)","v":""},"M",{"$f":"IF('Offerte montage'!I75=100,\"\",'Offerte montage'!J75)","v":0},null,{"$f":"IF(C153=\"G\",'Offerte goederen'!R75,IF(C153=\"M\",'Offerte montage'!L75,\"\"))","v":""},{"$f":"IF(C153=\"G\",'Offerte goederen'!S75,IF(C153=\"M\",'Offerte montage'!M75,\"\"))","v":""},null,{"$f":"IF(C153=\"G\",'Offerte goederen'!U75,IF(C153=\"M\",'Offerte montage'!O75,\"\"))","v":0},null,{"$f":"IF(C153=\"G\",'Offerte goederen'!W75,IF(C153=\"M\",'Offerte montage'!Q75,\"\"))","v":""},null,{"$f":"IF(C153=\"G\",'Offerte goederen'!Y75,IF(C153=\"M\",'Offerte montage'!S75,\"\"))","v":""}]
[{"$f":"'Offerte montage'!B76","v":0},{"$f":"IF('Offerte montage'!I76=100,'Offerte montage'!J76,'Offerte montage'!C76)","v":""},"M",{"$f":"IF('Offerte montage'!I76=100,\"\",'Offerte montage'!J76)","v":0},null,{"$f":"IF(C154=\"G\",'Offerte goederen'!R76,IF(C154=\"M\",'Offerte montage'!L76,\"\"))","v":""},{"$f":"IF(C154=\"G\",'Offerte goederen'!S76,IF(C154=\"M\",'Offerte montage'!M76,\"\"))","v":""},null,{"$f":"IF(C154=\"G\",'Offerte goederen'!U76,IF(C154=\"M\",'Offerte montage'!O76,\"\"))","v":0},null,{"$f":"IF(C154=\"G\",'Offerte goederen'!W76,IF(C154=\"M\",'Offerte montage'!Q76,\"\"))","v":""},null,{"$f":"IF(C154=\"G\",'Offerte goederen'!Y76,IF(C154=\"M\",'Offerte montage'!S76,\"\"))","v":""}]
[{"$f":"'Offerte montage'!B77","v":0},{"$f":"IF('Offerte montage'!I77=100,'Offerte montage'!J77,'Offerte montage'!C77)","v":""},"M",{"$f":"IF('Offerte montage'!I77=100,\"\",'Offerte montage'!J77)","v":0},null,{"$f":"IF(C155=\"G\",'Offerte goederen'!R77,IF(C155=\"M\",'Offerte montage'!L77,\"\"))","v":""},{"$f":"IF(C155=\"G\",'Offerte goederen'!S77,IF(C155=\"M\",'Offerte montage'!M77,\"\"))","v":""},null,{"$f":"IF(C155=\"G\",'Offerte goederen'!U77,IF(C155=\"M\",'Offerte montage'!O77,\"\"))","v":0},null,{"$f":"IF(C155=\"G\",'Offerte goederen'!W77,IF(C155=\"M\",'Offerte montage'!Q77,\"\"))","v":""},null,{"$f":"IF(C155=\"G\",'Offerte goederen'!Y77,IF(C155=\"M\",'Offerte montage'!S77,\"\"))","v":""}]
[{"$f":"'Offerte montage'!B78","v":0},{"$f":"IF('Offerte montage'!I78=100,'Offerte montage'!J78,'Offerte montage'!C78)","v":""},"M",{"$f":"IF('Offerte montage'!I78=100,\"\",'Offerte montage'!J78)","v":0},null,{"$f":"IF(C156=\"G\",'Offerte goederen'!R78,IF(C156=\"M\",'Offerte montage'!L78,\"\"))","v":""},{"$f":"IF(C156=\"G\",'Offerte goederen'!S78,IF(C156=\"M\",'Offerte montage'!M78,\"\"))","v":""},null,{"$f":"IF(C156=\"G\",'Offerte goederen'!U78,IF(C156=\"M\",'Offerte montage'!O78,\"\"))","v":0},null,{"$f":"IF(C156=\"G\",'Offerte goederen'!W78,IF(C156=\"M\",'Offerte montage'!Q78,\"\"))","v":""},null,{"$f":"IF(C156=\"G\",'Offerte goederen'!Y78,IF(C156=\"M\",'Offerte montage'!S78,\"\"))","v":""}]
[{"$f":"'Offerte montage'!B79","v":0},{"$f":"IF('Offerte montage'!I79=100,'Offerte montage'!J79,'Offerte montage'!C79)","v":""},"M",{"$f":"IF('Offerte montage'!I79=100,\"\",'Offerte montage'!J79)","v":0},null,{"$f":"IF(C157=\"G\",'Offerte goederen'!R79,IF(C157=\"M\",'Offerte montage'!L79,\"\"))","v":""},{"$f":"IF(C157=\"G\",'Offerte goederen'!S79,IF(C157=\"M\",'Offerte montage'!M79,\"\"))","v":""},null,{"$f":"IF(C157=\"G\",'Offerte goederen'!U79,IF(C157=\"M\",'Offerte montage'!O79,\"\"))","v":0},null,{"$f":"IF(C157=\"G\",'Offerte goederen'!W79,IF(C157=\"M\",'Offerte montage'!Q79,\"\"))","v":""},null,{"$f":"IF(C157=\"G\",'Offerte goederen'!Y79,IF(C157=\"M\",'Offerte montage'!S79,\"\"))","v":""}]
[{"$f":"'Offerte montage'!B80","v":0},{"$f":"IF('Offerte montage'!I80=100,'Offerte montage'!J80,'Offerte montage'!C80)","v":""},"M",{"$f":"IF('Offerte montage'!I80=100,\"\",'Offerte montage'!J80)","v":0},null,{"$f":"IF(C158=\"G\",'Offerte goederen'!R80,IF(C158=\"M\",'Offerte montage'!L80,\"\"))","v":""},{"$f":"IF(C158=\"G\",'Offerte goederen'!S80,IF(C158=\"M\",'Offerte montage'!M80,\"\"))","v":""},null,{"$f":"IF(C158=\"G\",'Offerte goederen'!U80,IF(C158=\"M\",'Offerte montage'!O80,\"\"))","v":0},null,{"$f":"IF(C158=\"G\",'Offerte goederen'!W80,IF(C158=\"M\",'Offerte montage'!Q80,\"\"))","v":""},null,{"$f":"IF(C158=\"G\",'Offerte goederen'!Y80,IF(C158=\"M\",'Offerte montage'!S80,\"\"))","v":""}]
[{"$f":"'Offerte montage'!B81","v":0},{"$f":"IF('Offerte montage'!I81=100,'Offerte montage'!J81,'Offerte montage'!C81)","v":""},"M",{"$f":"IF('Offerte montage'!I81=100,\"\",'Offerte montage'!J81)","v":0},null,{"$f":"IF(C159=\"G\",'Offerte goederen'!R81,IF(C159=\"M\",'Offerte montage'!L81,\"\"))","v":""},{"$f":"IF(C159=\"G\",'Offerte goederen'!S81,IF(C159=\"M\",'Offerte montage'!M81,\"\"))","v":""},null,{"$f":"IF(C159=\"G\",'Offerte goederen'!U81,IF(C159=\"M\",'Offerte montage'!O81,\"\"))","v":0},null,{"$f":"IF(C159=\"G\",'Offerte goederen'!W81,IF(C159=\"M\",'Offerte montage'!Q81,\"\"))","v":""},null,{"$f":"IF(C159=\"G\",'Offerte goederen'!Y81,IF(C159=\"M\",'Offerte montage'!S81,\"\"))","v":""}]
[{"$f":"'Offerte montage'!B82","v":0},{"$f":"IF('Offerte montage'!I82=100,'Offerte montage'!J82,'Offerte montage'!C82)","v":""},"M",{"$f":"IF('Offerte montage'!I82=100,\"\",'Offerte montage'!J82)","v":0},null,{"$f":"IF(C160=\"G\",'Offerte goederen'!R82,IF(C160=\"M\",'Offerte montage'!L82,\"\"))","v":""},{"$f":"IF(C160=\"G\",'Offerte goederen'!S82,IF(C160=\"M\",'Offerte montage'!M82,\"\"))","v":""},null,{"$f":"IF(C160=\"G\",'Offerte goederen'!U82,IF(C160=\"M\",'Offerte montage'!O82,\"\"))","v":0},null,{"$f":"IF(C160=\"G\",'Offerte goederen'!W82,IF(C160=\"M\",'Offerte montage'!Q82,\"\"))","v":""},null,{"$f":"IF(C160=\"G\",'Offerte goederen'!Y82,IF(C160=\"M\",'Offerte montage'!S82,\"\"))","v":""}]
[{"$f":"'Offerte montage'!B83","v":0},{"$f":"IF('Offerte montage'!I83=100,'Offerte montage'!J83,'Offerte montage'!C83)","v":""},"M",{"$f":"IF('Offerte montage'!I83=100,\"\",'Offerte montage'!J83)","v":0},null,{"$f":"IF(C161=\"G\",'Offerte goederen'!R83,IF(C161=\"M\",'Offerte montage'!L83,\"\"))","v":""},{"$f":"IF(C161=\"G\",'Offerte goederen'!S83,IF(C161=\"M\",'Offerte montage'!M83,\"\"))","v":""},null,{"$f":"IF(C161=\"G\",'Offerte goederen'!U83,IF(C161=\"M\",'Offerte montage'!O83,\"\"))","v":0},null,{"$f":"IF(C161=\"G\",'Offerte goederen'!W83,IF(C161=\"M\",'Offerte montage'!Q83,\"\"))","v":""},null,{"$f":"IF(C161=\"G\",'Offerte goederen'!Y83,IF(C161=\"M\",'Offerte montage'!S83,\"\"))","v":""}]
[{"$f":"'Offerte montage'!B84","v":0},{"$f":"IF('Offerte montage'!I84=100,'Offerte montage'!J84,'Offerte montage'!C84)","v":""},"M",{"$f":"IF('Offerte montage'!I84=100,\"\",'Offerte montage'!J84)","v":0},null,{"$f":"IF(C162=\"G\",'Offerte goederen'!R84,IF(C162=\"M\",'Offerte montage'!L84,\"\"))","v":""},{"$f":"IF(C162=\"G\",'Offerte goederen'!S84,IF(C162=\"M\",'Offerte montage'!M84,\"\"))","v":""},null,{"$f":"IF(C162=\"G\",'Offerte goederen'!U84,IF(C162=\"M\",'Offerte montage'!O84,\"\"))","v":0},null,{"$f":"IF(C162=\"G\",'Offerte goederen'!W84,IF(C162=\"M\",'Offerte montage'!Q84,\"\"))","v":""},null,{"$f":"IF(C162=\"G\",'Offerte goederen'!Y84,IF(C162=\"M\",'Offerte montage'!S84,\"\"))","v":""}]
[{"$f":"'Offerte montage'!B85","v":0},{"$f":"IF('Offerte montage'!I85=100,'Offerte montage'!J85,'Offerte montage'!C85)","v":""},"M",{"$f":"IF('Offerte montage'!I85=100,\"\",'Offerte montage'!J85)","v":0},null,{"$f":"IF(C163=\"G\",'Offerte goederen'!R85,IF(C163=\"M\",'Offerte montage'!L85,\"\"))","v":""},{"$f":"IF(C163=\"G\",'Offerte goederen'!S85,IF(C163=\"M\",'Offerte montage'!M85,\"\"))","v":""},null,{"$f":"IF(C163=\"G\",'Offerte goederen'!U85,IF(C163=\"M\",'Offerte montage'!O85,\"\"))","v":0},null,{"$f":"IF(C163=\"G\",'Offerte goederen'!W85,IF(C163=\"M\",'Offerte montage'!Q85,\"\"))","v":""},null,{"$f":"IF(C163=\"G\",'Offerte goederen'!Y85,IF(C163=\"M\",'Offerte montage'!S85,\"\"))","v":""}]
[{"$f":"'Offerte montage'!B86","v":0},{"$f":"IF('Offerte montage'!I86=100,'Offerte montage'!J86,'Offerte montage'!C86)","v":""},"M",{"$f":"IF('Offerte montage'!I86=100,\"\",'Offerte montage'!J86)","v":0},null,{"$f":"IF(C164=\"G\",'Offerte goederen'!R86,IF(C164=\"M\",'Offerte montage'!L86,\"\"))","v":""},{"$f":"IF(C164=\"G\",'Offerte goederen'!S86,IF(C164=\"M\",'Offerte montage'!M86,\"\"))","v":""},null,{"$f":"IF(C164=\"G\",'Offerte goederen'!U86,IF(C164=\"M\",'Offerte montage'!O86,\"\"))","v":0},null,{"$f":"IF(C164=\"G\",'Offerte goederen'!W86,IF(C164=\"M\",'Offerte montage'!Q86,\"\"))","v":""},null,{"$f":"IF(C164=\"G\",'Offerte goederen'!Y86,IF(C164=\"M\",'Offerte montage'!S86,\"\"))","v":""}]
[{"$f":"'Offerte montage'!B87","v":0},{"$f":"IF('Offerte montage'!I87=100,'Offerte montage'!J87,'Offerte montage'!C87)","v":""},"M",{"$f":"IF('Offerte montage'!I87=100,\"\",'Offerte montage'!J87)","v":0},null,{"$f":"IF(C165=\"G\",'Offerte goederen'!R87,IF(C165=\"M\",'Offerte montage'!L87,\"\"))","v":""},{"$f":"IF(C165=\"G\",'Offerte goederen'!S87,IF(C165=\"M\",'Offerte montage'!M87,\"\"))","v":""},null,{"$f":"IF(C165=\"G\",'Offerte goederen'!U87,IF(C165=\"M\",'Offerte montage'!O87,\"\"))","v":0},null,{"$f":"IF(C165=\"G\",'Offerte goederen'!W87,IF(C165=\"M\",'Offerte montage'!Q87,\"\"))","v":""},null,{"$f":"IF(C165=\"G\",'Offerte goederen'!Y87,IF(C165=\"M\",'Offerte montage'!S87,\"\"))","v":""}]
[{"$f":"'Offerte montage'!B88","v":0},{"$f":"IF('Offerte montage'!I88=100,'Offerte montage'!J88,'Offerte montage'!C88)","v":""},"M",{"$f":"IF('Offerte montage'!I88=100,\"\",'Offerte montage'!J88)","v":0},null,{"$f":"IF(C166=\"G\",'Offerte goederen'!R88,IF(C166=\"M\",'Offerte montage'!L88,\"\"))","v":""},{"$f":"IF(C166=\"G\",'Offerte goederen'!S88,IF(C166=\"M\",'Offerte montage'!M88,\"\"))","v":""},null,{"$f":"IF(C166=\"G\",'Offerte goederen'!U88,IF(C166=\"M\",'Offerte montage'!O88,\"\"))","v":0},null,{"$f":"IF(C166=\"G\",'Offerte goederen'!W88,IF(C166=\"M\",'Offerte montage'!Q88,\"\"))","v":""},null,{"$f":"IF(C166=\"G\",'Offerte goederen'!Y88,IF(C166=\"M\",'Offerte montage'!S88,\"\"))","v":""}]
[{"$f":"'Offerte montage'!B89","v":0},{"$f":"IF('Offerte montage'!I89=100,'Offerte montage'!J89,'Offerte montage'!C89)","v":""},"M",{"$f":"IF('Offerte montage'!I89=100,\"\",'Offerte montage'!J89)","v":0},null,{"$f":"IF(C167=\"G\",'Offerte goederen'!R89,IF(C167=\"M\",'Offerte montage'!L89,\"\"))","v":""},{"$f":"IF(C167=\"G\",'Offerte goederen'!S89,IF(C167=\"M\",'Offerte montage'!M89,\"\"))","v":""},null,{"$f":"IF(C167=\"G\",'Offerte goederen'!U89,IF(C167=\"M\",'Offerte montage'!O89,\"\"))","v":0},null,{"$f":"IF(C167=\"G\",'Offerte goederen'!W89,IF(C167=\"M\",'Offerte montage'!Q89,\"\"))","v":""},null,{"$f":"IF(C167=\"G\",'Offerte goederen'!Y89,IF(C167=\"M\",'Offerte montage'!S89,\"\"))","v":""}]
[{"$f":"'Offerte montage'!B90","v":0},{"$f":"IF('Offerte montage'!I90=100,'Offerte montage'!J90,'Offerte montage'!C90)","v":""},"M",{"$f":"IF('Offerte montage'!I90=100,\"\",'Offerte montage'!J90)","v":0},null,{"$f":"IF(C168=\"G\",'Offerte goederen'!R90,IF(C168=\"M\",'Offerte montage'!L90,\"\"))","v":""},{"$f":"IF(C168=\"G\",'Offerte goederen'!S90,IF(C168=\"M\",'Offerte montage'!M90,\"\"))","v":""},null,{"$f":"IF(C168=\"G\",'Offerte goederen'!U90,IF(C168=\"M\",'Offerte montage'!O90,\"\"))","v":0},null,{"$f":"IF(C168=\"G\",'Offerte goederen'!W90,IF(C168=\"M\",'Offerte montage'!Q90,\"\"))","v":""},null,{"$f":"IF(C168=\"G\",'Offerte goederen'!Y90,IF(C168=\"M\",'Offerte montage'!S90,\"\"))","v":""}]
[{"$f":"'Offerte montage'!B91","v":0},{"$f":"IF('Offerte montage'!I91=100,'Offerte montage'!J91,'Offerte montage'!C91)","v":""},"M",{"$f":"IF('Offerte montage'!I91=100,\"\",'Offerte montage'!J91)","v":0},null,{"$f":"IF(C169=\"G\",'Offerte goederen'!R91,IF(C169=\"M\",'Offerte montage'!L91,\"\"))","v":""},{"$f":"IF(C169=\"G\",'Offerte goederen'!S91,IF(C169=\"M\",'Offerte montage'!M91,\"\"))","v":""},null,{"$f":"IF(C169=\"G\",'Offerte goederen'!U91,IF(C169=\"M\",'Offerte montage'!O91,\"\"))","v":0},null,{"$f":"IF(C169=\"G\",'Offerte goederen'!W91,IF(C169=\"M\",'Offerte montage'!Q91,\"\"))","v":""},null,{"$f":"IF(C169=\"G\",'Offerte goederen'!Y91,IF(C169=\"M\",'Offerte montage'!S91,\"\"))","v":""}]
[{"$f":"'Offerte montage'!B92","v":0},{"$f":"IF('Offerte montage'!I92=100,'Offerte montage'!J92,'Offerte montage'!C92)","v":""},"M",{"$f":"IF('Offerte montage'!I92=100,\"\",'Offerte montage'!J92)","v":0},null,{"$f":"IF(C170=\"G\",'Offerte goederen'!R92,IF(C170=\"M\",'Offerte montage'!L92,\"\"))","v":""},{"$f":"IF(C170=\"G\",'Offerte goederen'!S92,IF(C170=\"M\",'Offerte montage'!M92,\"\"))","v":""},null,{"$f":"IF(C170=\"G\",'Offerte goederen'!U92,IF(C170=\"M\",'Offerte montage'!O92,\"\"))","v":0},null,{"$f":"IF(C170=\"G\",'Offerte goederen'!W92,IF(C170=\"M\",'Offerte montage'!Q92,\"\"))","v":""},null,{"$f":"IF(C170=\"G\",'Offerte goederen'!Y92,IF(C170=\"M\",'Offerte montage'!S92,\"\"))","v":""}]
[{"$f":"'Offerte montage'!B93","v":0},{"$f":"IF('Offerte montage'!I93=100,'Offerte montage'!J93,'Offerte montage'!C93)","v":""},"M",{"$f":"IF('Offerte montage'!I93=100,\"\",'Offerte montage'!J93)","v":0},null,{"$f":"IF(C171=\"G\",'Offerte goederen'!R93,IF(C171=\"M\",'Offerte montage'!L93,\"\"))","v":""},{"$f":"IF(C171=\"G\",'Offerte goederen'!S93,IF(C171=\"M\",'Offerte montage'!M93,\"\"))","v":""},null,{"$f":"IF(C171=\"G\",'Offerte goederen'!U93,IF(C171=\"M\",'Offerte montage'!O93,\"\"))","v":0},null,{"$f":"IF(C171=\"G\",'Offerte goederen'!W93,IF(C171=\"M\",'Offerte montage'!Q93,\"\"))","v":""},null,{"$f":"IF(C171=\"G\",'Offerte goederen'!Y93,IF(C171=\"M\",'Offerte montage'!S93,\"\"))","v":""}]
[{"$f":"'Offerte montage'!B94","v":0},{"$f":"IF('Offerte montage'!I94=100,'Offerte montage'!J94,'Offerte montage'!C94)","v":""},"M",{"$f":"IF('Offerte montage'!I94=100,\"\",'Offerte montage'!J94)","v":0},null,{"$f":"IF(C172=\"G\",'Offerte goederen'!R94,IF(C172=\"M\",'Offerte montage'!L94,\"\"))","v":""},{"$f":"IF(C172=\"G\",'Offerte goederen'!S94,IF(C172=\"M\",'Offerte montage'!M94,\"\"))","v":""},null,{"$f":"IF(C172=\"G\",'Offerte goederen'!U94,IF(C172=\"M\",'Offerte montage'!O94,\"\"))","v":0},null,{"$f":"IF(C172=\"G\",'Offerte goederen'!W94,IF(C172=\"M\",'Offerte montage'!Q94,\"\"))","v":""},null,{"$f":"IF(C172=\"G\",'Offerte goederen'!Y94,IF(C172=\"M\",'Offerte montage'!S94,\"\"))","v":""}]
[{"$f":"'Offerte montage'!B95","v":0},{"$f":"IF('Offerte montage'!I95=100,'Offerte montage'!J95,'Offerte montage'!C95)","v":""},"M",{"$f":"IF('Offerte montage'!I95=100,\"\",'Offerte montage'!J95)","v":0},null,{"$f":"IF(C173=\"G\",'Offerte goederen'!R95,IF(C173=\"M\",'Offerte montage'!L95,\"\"))","v":""},{"$f":"IF(C173=\"G\",'Offerte goederen'!S95,IF(C173=\"M\",'Offerte montage'!M95,\"\"))","v":""},null,{"$f":"IF(C173=\"G\",'Offerte goederen'!U95,IF(C173=\"M\",'Offerte montage'!O95,\"\"))","v":0},null,{"$f":"IF(C173=\"G\",'Offerte goederen'!W95,IF(C173=\"M\",'Offerte montage'!Q95,\"\"))","v":""},null,{"$f":"IF(C173=\"G\",'Offerte goederen'!Y95,IF(C173=\"M\",'Offerte montage'!S95,\"\"))","v":""}]
[{"$f":"'Offerte montage'!B96","v":0},{"$f":"IF('Offerte montage'!I96=100,'Offerte montage'!J96,'Offerte montage'!C96)","v":""},"M",{"$f":"IF('Offerte montage'!I96=100,\"\",'Offerte montage'!J96)","v":0},null,{"$f":"IF(C174=\"G\",'Offerte goederen'!R96,IF(C174=\"M\",'Offerte montage'!L96,\"\"))","v":""},{"$f":"IF(C174=\"G\",'Offerte goederen'!S96,IF(C174=\"M\",'Offerte montage'!M96,\"\"))","v":""},null,{"$f":"IF(C174=\"G\",'Offerte goederen'!U96,IF(C174=\"M\",'Offerte montage'!O96,\"\"))","v":0},null,{"$f":"IF(C174=\"G\",'Offerte goederen'!W96,IF(C174=\"M\",'Offerte montage'!Q96,\"\"))","v":""},null,{"$f":"IF(C174=\"G\",'Offerte goederen'!Y96,IF(C174=\"M\",'Offerte montage'!S96,\"\"))","v":""}]
[{"$f":"'Offerte montage'!B97","v":0},{"$f":"IF('Offerte montage'!I97=100,'Offerte montage'!J97,'Offerte montage'!C97)","v":""},"M",{"$f":"IF('Offerte montage'!I97=100,\"\",'Offerte montage'!J97)","v":0},null,{"$f":"IF(C175=\"G\",'Offerte goederen'!R97,IF(C175=\"M\",'Offerte montage'!L97,\"\"))","v":""},{"$f":"IF(C175=\"G\",'Offerte goederen'!S97,IF(C175=\"M\",'Offerte montage'!M97,\"\"))","v":""},null,{"$f":"IF(C175=\"G\",'Offerte goederen'!U97,IF(C175=\"M\",'Offerte montage'!O97,\"\"))","v":0},null,{"$f":"IF(C175=\"G\",'Offerte goederen'!W97,IF(C175=\"M\",'Offerte montage'!Q97,\"\"))","v":""},null,{"$f":"IF(C175=\"G\",'Offerte goederen'!Y97,IF(C175=\"M\",'Offerte montage'!S97,\"\"))","v":""}]
[{"$f":"'Offerte montage'!B98","v":0},{"$f":"IF('Offerte montage'!I98=100,'Offerte montage'!J98,'Offerte montage'!C98)","v":""},"M",{"$f":"IF('Offerte montage'!I98=100,\"\",'Offerte montage'!J98)","v":0},null,{"$f":"IF(C176=\"G\",'Offerte goederen'!R98,IF(C176=\"M\",'Offerte montage'!L98,\"\"))","v":""},{"$f":"IF(C176=\"G\",'Offerte goederen'!S98,IF(C176=\"M\",'Offerte montage'!M98,\"\"))","v":""},null,{"$f":"IF(C176=\"G\",'Offerte goederen'!U98,IF(C176=\"M\",'Offerte montage'!O98,\"\"))","v":0},null,{"$f":"IF(C176=\"G\",'Offerte goederen'!W98,IF(C176=\"M\",'Offerte montage'!Q98,\"\"))","v":""},null,{"$f":"IF(C176=\"G\",'Offerte goederen'!Y98,IF(C176=\"M\",'Offerte montage'!S98,\"\"))","v":""}]
[{"$f":"'Offerte montage'!B99","v":0},{"$f":"IF('Offerte montage'!I99=100,'Offerte montage'!J99,'Offerte montage'!C99)","v":""},"M",{"$f":"IF('Offerte montage'!I99=100,\"\",'Offerte montage'!J99)","v":0},null,{"$f":"IF(C177=\"G\",'Offerte goederen'!R99,IF(C177=\"M\",'Offerte montage'!L99,\"\"))","v":""},{"$f":"IF(C177=\"G\",'Offerte goederen'!S99,IF(C177=\"M\",'Offerte montage'!M99,\"\"))","v":""},null,{"$f":"IF(C177=\"G\",'Offerte goederen'!U99,IF(C177=\"M\",'Offerte montage'!O99,\"\"))","v":0},null,{"$f":"IF(C177=\"G\",'Offerte goederen'!W99,IF(C177=\"M\",'Offerte montage'!Q99,\"\"))","v":""},null,{"$f":"IF(C177=\"G\",'Offerte goederen'!Y99,IF(C177=\"M\",'Offerte montage'!S99,\"\"))","v":""}]
[{"$f":"'Offerte montage'!B100","v":0},{"$f":"IF('Offerte montage'!I100=100,'Offerte montage'!J100,'Offerte montage'!C100)","v":""},"M",{"$f":"IF('Offerte montage'!I100=100,\"\",'Offerte montage'!J100)","v":0},null,{"$f":"IF(C178=\"G\",'Offerte goederen'!R100,IF(C178=\"M\",'Offerte montage'!L100,\"\"))","v":""},{"$f":"IF(C178=\"G\",'Offerte goederen'!S100,IF(C178=\"M\",'Offerte montage'!M100,\"\"))","v":""},null,{"$f":"IF(C178=\"G\",'Offerte goederen'!U100,IF(C178=\"M\",'Offerte montage'!O100,\"\"))","v":0},null,{"$f":"IF(C178=\"G\",'Offerte goederen'!W100,IF(C178=\"M\",'Offerte montage'!Q100,\"\"))","v":""},null,{"$f":"IF(C178=\"G\",'Offerte goederen'!Y100,IF(C178=\"M\",'Offerte montage'!S100,\"\"))","v":""}]
[{"$f":"'Offerte montage'!B101","v":0},{"$f":"IF('Offerte montage'!I101=100,'Offerte montage'!J101,'Offerte montage'!C101)","v":""},"M",{"$f":"IF('Offerte montage'!I101=100,\"\",'Offerte montage'!J101)","v":0},null,{"$f":"IF(C179=\"G\",'Offerte goederen'!R101,IF(C179=\"M\",'Offerte montage'!L101,\"\"))","v":""},{"$f":"IF(C179=\"G\",'Offerte goederen'!S101,IF(C179=\"M\",'Offerte montage'!M101,\"\"))","v":""},null,{"$f":"IF(C179=\"G\",'Offerte goederen'!U101,IF(C179=\"M\",'Offerte montage'!O101,\"\"))","v":0},null,{"$f":"IF(C179=\"G\",'Offerte goederen'!W101,IF(C179=\"M\",'Offerte montage'!Q101,\"\"))","v":""},null,{"$f":"IF(C179=\"G\",'Offerte goederen'!Y101,IF(C179=\"M\",'Offerte montage'!S101,\"\"))","v":""}]
[{"$f":"'Offerte montage'!B102","v":0},{"$f":"IF('Offerte montage'!I102=100,'Offerte montage'!J102,'Offerte montage'!C102)","v":""},"M",{"$f":"IF('Offerte montage'!I102=100,\"\",'Offerte montage'!J102)","v":0},null,{"$f":"IF(C180=\"G\",'Offerte goederen'!R102,IF(C180=\"M\",'Offerte montage'!L102,\"\"))","v":""},{"$f":"IF(C180=\"G\",'Offerte goederen'!S102,IF(C180=\"M\",'Offerte montage'!M102,\"\"))","v":""},null,{"$f":"IF(C180=\"G\",'Offerte goederen'!U102,IF(C180=\"M\",'Offerte montage'!O102,\"\"))","v":0},null,{"$f":"IF(C180=\"G\",'Offerte goederen'!W102,IF(C180=\"M\",'Offerte montage'!Q102,\"\"))","v":""},null,{"$f":"IF(C180=\"G\",'Offerte goederen'!Y102,IF(C180=\"M\",'Offerte montage'!S102,\"\"))","v":""}]
[{"$f":"'Offerte montage'!B103","v":0},{"$f":"IF('Offerte montage'!I103=100,'Offerte montage'!J103,'Offerte montage'!C103)","v":""},"M",{"$f":"IF('Offerte montage'!I103=100,\"\",'Offerte montage'!J103)","v":0},null,{"$f":"IF(C181=\"G\",'Offerte goederen'!R103,IF(C181=\"M\",'Offerte montage'!L103,\"\"))","v":""},{"$f":"IF(C181=\"G\",'Offerte goederen'!S103,IF(C181=\"M\",'Offerte montage'!M103,\"\"))","v":""},null,{"$f":"IF(C181=\"G\",'Offerte goederen'!U103,IF(C181=\"M\",'Offerte montage'!O103,\"\"))","v":0},null,{"$f":"IF(C181=\"G\",'Offerte goederen'!W103,IF(C181=\"M\",'Offerte montage'!Q103,\"\"))","v":""},null,{"$f":"IF(C181=\"G\",'Offerte goederen'!Y103,IF(C181=\"M\",'Offerte montage'!S103,\"\"))","v":""}]
[{"$f":"'Offerte montage'!B104","v":0},{"$f":"IF('Offerte montage'!I104=100,'Offerte montage'!J104,'Offerte montage'!C104)","v":""},"M",{"$f":"IF('Offerte montage'!I104=100,\"\",'Offerte montage'!J104)","v":0},null,{"$f":"IF(C182=\"G\",'Offerte goederen'!R104,IF(C182=\"M\",'Offerte montage'!L104,\"\"))","v":""},{"$f":"IF(C182=\"G\",'Offerte goederen'!S104,IF(C182=\"M\",'Offerte montage'!M104,\"\"))","v":""},null,{"$f":"IF(C182=\"G\",'Offerte goederen'!U104,IF(C182=\"M\",'Offerte montage'!O104,\"\"))","v":0},null,{"$f":"IF(C182=\"G\",'Offerte goederen'!W104,IF(C182=\"M\",'Offerte montage'!Q104,\"\"))","v":""},null,{"$f":"IF(C182=\"G\",'Offerte goederen'!Y104,IF(C182=\"M\",'Offerte montage'!S104,\"\"))","v":""}]
[{"$f":"'Offerte montage'!B105","v":0},{"$f":"IF('Offerte montage'!I105=100,'Offerte montage'!J105,'Offerte montage'!C105)","v":""},"M",{"$f":"IF('Offerte montage'!I105=100,\"\",'Offerte montage'!J105)","v":0},null,{"$f":"IF(C183=\"G\",'Offerte goederen'!R105,IF(C183=\"M\",'Offerte montage'!L105,\"\"))","v":""},{"$f":"IF(C183=\"G\",'Offerte goederen'!S105,IF(C183=\"M\",'Offerte montage'!M105,\"\"))","v":""},null,{"$f":"IF(C183=\"G\",'Offerte goederen'!U105,IF(C183=\"M\",'Offerte montage'!O105,\"\"))","v":0},null,{"$f":"IF(C183=\"G\",'Offerte goederen'!W105,IF(C183=\"M\",'Offerte montage'!Q105,\"\"))","v":""},null,{"$f":"IF(C183=\"G\",'Offerte goederen'!Y105,IF(C183=\"M\",'Offerte montage'!S105,\"\"))","v":""}]
[{"$f":"'Offerte montage'!B106","v":0},{"$f":"IF('Offerte montage'!I106=100,'Offerte montage'!J106,'Offerte montage'!C106)","v":""},"M",{"$f":"IF('Offerte montage'!I106=100,\"\",'Offerte montage'!J106)","v":0},null,{"$f":"IF(C184=\"G\",'Offerte goederen'!R106,IF(C184=\"M\",'Offerte montage'!L106,\"\"))","v":""},{"$f":"IF(C184=\"G\",'Offerte goederen'!S106,IF(C184=\"M\",'Offerte montage'!M106,\"\"))","v":""},null,{"$f":"IF(C184=\"G\",'Offerte goederen'!U106,IF(C184=\"M\",'Offerte montage'!O106,\"\"))","v":0},null,{"$f":"IF(C184=\"G\",'Offerte goederen'!W106,IF(C184=\"M\",'Offerte montage'!Q106,\"\"))","v":""},null,{"$f":"IF(C184=\"G\",'Offerte goederen'!Y106,IF(C184=\"M\",'Offerte montage'!S106,\"\"))","v":""}]
[{"$f":"'Offerte montage'!B107","v":0},{"$f":"IF('Offerte montage'!I107=100,'Offerte montage'!J107,'Offerte montage'!C107)","v":""},"M",{"$f":"IF('Offerte montage'!I107=100,\"\",'Offerte montage'!J107)","v":0},null,{"$f":"IF(C185=\"G\",'Offerte goederen'!R107,IF(C185=\"M\",'Offerte montage'!L107,\"\"))","v":""},{"$f":"IF(C185=\"G\",'Offerte goederen'!S107,IF(C185=\"M\",'Offerte montage'!M107,\"\"))","v":""},null,{"$f":"IF(C185=\"G\",'Offerte goederen'!U107,IF(C185=\"M\",'Offerte montage'!O107,\"\"))","v":0},null,{"$f":"IF(C185=\"G\",'Offerte goederen'!W107,IF(C185=\"M\",'Offerte montage'!Q107,\"\"))","v":""},null,{"$f":"IF(C185=\"G\",'Offerte goederen'!Y107,IF(C185=\"M\",'Offerte montage'!S107,\"\"))","v":""}]
[{"$f":"'Offerte montage'!B108","v":0},{"$f":"IF('Offerte montage'!I108=100,'Offerte montage'!J108,'Offerte montage'!C108)","v":""},"M",{"$f":"IF('Offerte montage'!I108=100,\"\",'Offerte montage'!J108)","v":0},null,{"$f":"IF(C186=\"G\",'Offerte goederen'!R108,IF(C186=\"M\",'Offerte montage'!L108,\"\"))","v":""},{"$f":"IF(C186=\"G\",'Offerte goederen'!S108,IF(C186=\"M\",'Offerte montage'!M108,\"\"))","v":""},null,{"$f":"IF(C186=\"G\",'Offerte goederen'!U108,IF(C186=\"M\",'Offerte montage'!O108,\"\"))","v":0},null,{"$f":"IF(C186=\"G\",'Offerte goederen'!W108,IF(C186=\"M\",'Offerte montage'!Q108,\"\"))","v":""},null,{"$f":"IF(C186=\"G\",'Offerte goederen'!Y108,IF(C186=\"M\",'Offerte montage'!S108,\"\"))","v":""}]
[{"$f":"'Offerte montage'!B109","v":0},{"$f":"IF('Offerte montage'!I109=100,'Offerte montage'!J109,'Offerte montage'!C109)","v":""},"M",{"$f":"IF('Offerte montage'!I109=100,\"\",'Offerte montage'!J109)","v":0},null,{"$f":"IF(C187=\"G\",'Offerte goederen'!R109,IF(C187=\"M\",'Offerte montage'!L109,\"\"))","v":""},{"$f":"IF(C187=\"G\",'Offerte goederen'!S109,IF(C187=\"M\",'Offerte montage'!M109,\"\"))","v":""},null,{"$f":"IF(C187=\"G\",'Offerte goederen'!U109,IF(C187=\"M\",'Offerte montage'!O109,\"\"))","v":0},null,{"$f":"IF(C187=\"G\",'Offerte goederen'!W109,IF(C187=\"M\",'Offerte montage'!Q109,\"\"))","v":""},null,{"$f":"IF(C187=\"G\",'Offerte goederen'!Y109,IF(C187=\"M\",'Offerte montage'!S109,\"\"))","v":""}]
[{"$f":"'Offerte montage'!B110","v":0},{"$f":"IF('Offerte montage'!I110=100,'Offerte montage'!J110,'Offerte montage'!C110)","v":""},"M",{"$f":"IF('Offerte montage'!I110=100,\"\",'Offerte montage'!J110)","v":0},null,{"$f":"IF(C188=\"G\",'Offerte goederen'!R110,IF(C188=\"M\",'Offerte montage'!L110,\"\"))","v":""},{"$f":"IF(C188=\"G\",'Offerte goederen'!S110,IF(C188=\"M\",'Offerte montage'!M110,\"\"))","v":""},null,{"$f":"IF(C188=\"G\",'Offerte goederen'!U110,IF(C188=\"M\",'Offerte montage'!O110,\"\"))","v":0},null,{"$f":"IF(C188=\"G\",'Offerte goederen'!W110,IF(C188=\"M\",'Offerte montage'!Q110,\"\"))","v":""},null,{"$f":"IF(C188=\"G\",'Offerte goederen'!Y110,IF(C188=\"M\",'Offerte montage'!S110,\"\"))","v":""}]
[{"$f":"'Offerte montage'!B111","v":0},{"$f":"IF('Offerte montage'!I111=100,'Offerte montage'!J111,'Offerte montage'!C111)","v":""},"M",{"$f":"IF('Offerte montage'!I111=100,\"\",'Offerte montage'!J111)","v":0},null,{"$f":"IF(C189=\"G\",'Offerte goederen'!R111,IF(C189=\"M\",'Offerte montage'!L111,\"\"))","v":""},{"$f":"IF(C189=\"G\",'Offerte goederen'!S111,IF(C189=\"M\",'Offerte montage'!M111,\"\"))","v":""},null,{"$f":"IF(C189=\"G\",'Offerte goederen'!U111,IF(C189=\"M\",'Offerte montage'!O111,\"\"))","v":0},null,{"$f":"IF(C189=\"G\",'Offerte goederen'!W111,IF(C189=\"M\",'Offerte montage'!Q111,\"\"))","v":""},null,{"$f":"IF(C189=\"G\",'Offerte goederen'!Y111,IF(C189=\"M\",'Offerte montage'!S111,\"\"))","v":""}]
[{"$f":"'Offerte montage'!B112","v":0},{"$f":"IF('Offerte montage'!I112=100,'Offerte montage'!J112,'Offerte montage'!C112)","v":""},"M",{"$f":"IF('Offerte montage'!I112=100,\"\",'Offerte montage'!J112)","v":0},null,{"$f":"IF(C190=\"G\",'Offerte goederen'!R112,IF(C190=\"M\",'Offerte montage'!L112,\"\"))","v":""},{"$f":"IF(C190=\"G\",'Offerte goederen'!S112,IF(C190=\"M\",'Offerte montage'!M112,\"\"))","v":""},null,{"$f":"IF(C190=\"G\",'Offerte goederen'!U112,IF(C190=\"M\",'Offerte montage'!O112,\"\"))","v":0},null,{"$f":"IF(C190=\"G\",'Offerte goederen'!W112,IF(C190=\"M\",'Offerte montage'!Q112,\"\"))","v":""},null,{"$f":"IF(C190=\"G\",'Offerte goederen'!Y112,IF(C190=\"M\",'Offerte montage'!S112,\"\"))","v":""}]
[{"$f":"'Offerte montage'!B113","v":0},{"$f":"IF('Offerte montage'!I113=100,'Offerte montage'!J113,'Offerte montage'!C113)","v":""},"M",{"$f":"IF('Offerte montage'!I113=100,\"\",'Offerte montage'!J113)","v":0},null,{"$f":"IF(C191=\"G\",'Offerte goederen'!R113,IF(C191=\"M\",'Offerte montage'!L113,\"\"))","v":""},{"$f":"IF(C191=\"G\",'Offerte goederen'!S113,IF(C191=\"M\",'Offerte montage'!M113,\"\"))","v":""},null,{"$f":"IF(C191=\"G\",'Offerte goederen'!U113,IF(C191=\"M\",'Offerte montage'!O113,\"\"))","v":0},null,{"$f":"IF(C191=\"G\",'Offerte goederen'!W113,IF(C191=\"M\",'Offerte montage'!Q113,\"\"))","v":""},null,{"$f":"IF(C191=\"G\",'Offerte goederen'!Y113,IF(C191=\"M\",'Offerte montage'!S113,\"\"))","v":""}]
[{"$f":"'Offerte montage'!B114","v":0},{"$f":"IF('Offerte montage'!I114=100,'Offerte montage'!J114,'Offerte montage'!C114)","v":""},"M",{"$f":"IF('Offerte montage'!I114=100,\"\",'Offerte montage'!J114)","v":0},null,{"$f":"IF(C192=\"G\",'Offerte goederen'!R114,IF(C192=\"M\",'Offerte montage'!L114,\"\"))","v":""},{"$f":"IF(C192=\"G\",'Offerte goederen'!S114,IF(C192=\"M\",'Offerte montage'!M114,\"\"))","v":""},null,{"$f":"IF(C192=\"G\",'Offerte goederen'!U114,IF(C192=\"M\",'Offerte montage'!O114,\"\"))","v":0},null,{"$f":"IF(C192=\"G\",'Offerte goederen'!W114,IF(C192=\"M\",'Offerte montage'!Q114,\"\"))","v":""},null,{"$f":"IF(C192=\"G\",'Offerte goederen'!Y114,IF(C192=\"M\",'Offerte montage'!S114,\"\"))","v":""}]
[{"$f":"'Offerte montage'!B115","v":0},{"$f":"IF('Offerte montage'!I115=100,'Offerte montage'!J115,'Offerte montage'!C115)","v":""},"M",{"$f":"IF('Offerte montage'!I115=100,\"\",'Offerte montage'!J115)","v":0},null,{"$f":"IF(C193=\"G\",'Offerte goederen'!R115,IF(C193=\"M\",'Offerte montage'!L115,\"\"))","v":""},{"$f":"IF(C193=\"G\",'Offerte goederen'!S115,IF(C193=\"M\",'Offerte montage'!M115,\"\"))","v":""},null,{"$f":"IF(C193=\"G\",'Offerte goederen'!U115,IF(C193=\"M\",'Offerte montage'!O115,\"\"))","v":0},null,{"$f":"IF(C193=\"G\",'Offerte goederen'!W115,IF(C193=\"M\",'Offerte montage'!Q115,\"\"))","v":""},null,{"$f":"IF(C193=\"G\",'Offerte goederen'!Y115,IF(C193=\"M\",'Offerte montage'!S115,\"\"))","v":""}]
[{"$f":"'Offerte montage'!B116","v":0},{"$f":"IF('Offerte montage'!I116=100,'Offerte montage'!J116,'Offerte montage'!C116)","v":""},"M",{"$f":"IF('Offerte montage'!I116=100,\"\",'Offerte montage'!J116)","v":0},null,{"$f":"IF(C194=\"G\",'Offerte goederen'!R116,IF(C194=\"M\",'Offerte montage'!L116,\"\"))","v":""},{"$f":"IF(C194=\"G\",'Offerte goederen'!S116,IF(C194=\"M\",'Offerte montage'!M116,\"\"))","v":""},null,{"$f":"IF(C194=\"G\",'Offerte goederen'!U116,IF(C194=\"M\",'Offerte montage'!O116,\"\"))","v":0},null,{"$f":"IF(C194=\"G\",'Offerte goederen'!W116,IF(C194=\"M\",'Offerte montage'!Q116,\"\"))","v":""},null,{"$f":"IF(C194=\"G\",'Offerte goederen'!Y116,IF(C194=\"M\",'Offerte montage'!S116,\"\"))","v":""}]
[{"$f":"'Offerte montage'!B117","v":0},{"$f":"IF('Offerte montage'!I117=100,'Offerte montage'!J117,'Offerte montage'!C117)","v":""},"M",{"$f":"IF('Offerte montage'!I117=100,\"\",'Offerte montage'!J117)","v":0},null,{"$f":"IF(C195=\"G\",'Offerte goederen'!R117,IF(C195=\"M\",'Offerte montage'!L117,\"\"))","v":""},{"$f":"IF(C195=\"G\",'Offerte goederen'!S117,IF(C195=\"M\",'Offerte montage'!M117,\"\"))","v":""},null,{"$f":"IF(C195=\"G\",'Offerte goederen'!U117,IF(C195=\"M\",'Offerte montage'!O117,\"\"))","v":0},null,{"$f":"IF(C195=\"G\",'Offerte goederen'!W117,IF(C195=\"M\",'Offerte montage'!Q117,\"\"))","v":""},null,{"$f":"IF(C195=\"G\",'Offerte goederen'!Y117,IF(C195=\"M\",'Offerte montage'!S117,\"\"))","v":""}]
[{"$f":"'Offerte montage'!B118","v":0},{"$f":"IF('Offerte montage'!I118=100,'Offerte montage'!J118,'Offerte montage'!C118)","v":""},"M",{"$f":"IF('Offerte montage'!I118=100,\"\",'Offerte montage'!J118)","v":0},null,{"$f":"IF(C196=\"G\",'Offerte goederen'!R118,IF(C196=\"M\",'Offerte montage'!L118,\"\"))","v":""},{"$f":"IF(C196=\"G\",'Offerte goederen'!S118,IF(C196=\"M\",'Offerte montage'!M118,\"\"))","v":""},null,{"$f":"IF(C196=\"G\",'Offerte goederen'!U118,IF(C196=\"M\",'Offerte montage'!O118,\"\"))","v":0},null,{"$f":"IF(C196=\"G\",'Offerte goederen'!W118,IF(C196=\"M\",'Offerte montage'!Q118,\"\"))","v":""},null,{"$f":"IF(C196=\"G\",'Offerte goederen'!Y118,IF(C196=\"M\",'Offerte montage'!S118,\"\"))","v":""}]
[{"$f":"'Offerte montage'!B119","v":0},{"$f":"IF('Offerte montage'!I119=100,'Offerte montage'!J119,'Offerte montage'!C119)","v":""},"M",{"$f":"IF('Offerte montage'!I119=100,\"\",'Offerte montage'!J119)","v":0},null,{"$f":"IF(C197=\"G\",'Offerte goederen'!R119,IF(C197=\"M\",'Offerte montage'!L119,\"\"))","v":""},{"$f":"IF(C197=\"G\",'Offerte goederen'!S119,IF(C197=\"M\",'Offerte montage'!M119,\"\"))","v":""},null,{"$f":"IF(C197=\"G\",'Offerte goederen'!U119,IF(C197=\"M\",'Offerte montage'!O119,\"\"))","v":0},null,{"$f":"IF(C197=\"G\",'Offerte goederen'!W119,IF(C197=\"M\",'Offerte montage'!Q119,\"\"))","v":""},null,{"$f":"IF(C197=\"G\",'Offerte goederen'!Y119,IF(C197=\"M\",'Offerte montage'!S119,\"\"))","v":""}]
[{"$f":"'Offerte montage'!B120","v":0},{"$f":"IF('Offerte montage'!I120=100,'Offerte montage'!J120,'Offerte montage'!C120)","v":""},"M",{"$f":"IF('Offerte montage'!I120=100,\"\",'Offerte montage'!J120)","v":0},null,{"$f":"IF(C198=\"G\",'Offerte goederen'!R120,IF(C198=\"M\",'Offerte montage'!L120,\"\"))","v":""},{"$f":"IF(C198=\"G\",'Offerte goederen'!S120,IF(C198=\"M\",'Offerte montage'!M120,\"\"))","v":""},null,{"$f":"IF(C198=\"G\",'Offerte goederen'!U120,IF(C198=\"M\",'Offerte montage'!O120,\"\"))","v":0},null,{"$f":"IF(C198=\"G\",'Offerte goederen'!W120,IF(C198=\"M\",'Offerte montage'!Q120,\"\"))","v":""},null,{"$f":"IF(C198=\"G\",'Offerte goederen'!Y120,IF(C198=\"M\",'Offerte montage'!S120,\"\"))","v":""}]
[{"$f":"'Offerte montage'!B121","v":0},{"$f":"IF('Offerte montage'!I121=100,'Offerte montage'!J121,'Offerte montage'!C121)","v":""},"M",{"$f":"IF('Offerte montage'!I121=100,\"\",'Offerte montage'!J121)","v":0},null,{"$f":"IF(C199=\"G\",'Offerte goederen'!R121,IF(C199=\"M\",'Offerte montage'!L121,\"\"))","v":""},{"$f":"IF(C199=\"G\",'Offerte goederen'!S121,IF(C199=\"M\",'Offerte montage'!M121,\"\"))","v":""},null,{"$f":"IF(C199=\"G\",'Offerte goederen'!U121,IF(C199=\"M\",'Offerte montage'!O121,\"\"))","v":0},null,{"$f":"IF(C199=\"G\",'Offerte goederen'!W121,IF(C199=\"M\",'Offerte montage'!Q121,\"\"))","v":""},null,{"$f":"IF(C199=\"G\",'Offerte goederen'!Y121,IF(C199=\"M\",'Offerte montage'!S121,\"\"))","v":""}]
[{"$f":"'Offerte montage'!B122","v":0},{"$f":"IF('Offerte montage'!I122=100,'Offerte montage'!J122,'Offerte montage'!C122)","v":""},"M",{"$f":"IF('Offerte montage'!I122=100,\"\",'Offerte montage'!J122)","v":0},null,{"$f":"IF(C200=\"G\",'Offerte goederen'!R122,IF(C200=\"M\",'Offerte montage'!L122,\"\"))","v":""},{"$f":"IF(C200=\"G\",'Offerte goederen'!S122,IF(C200=\"M\",'Offerte montage'!M122,\"\"))","v":""},null,{"$f":"IF(C200=\"G\",'Offerte goederen'!U122,IF(C200=\"M\",'Offerte montage'!O122,\"\"))","v":0},null,{"$f":"IF(C200=\"G\",'Offerte goederen'!W122,IF(C200=\"M\",'Offerte montage'!Q122,\"\"))","v":""},null,{"$f":"IF(C200=\"G\",'Offerte goederen'!Y122,IF(C200=\"M\",'Offerte montage'!S122,\"\"))","v":""}]
[{"$f":"'Offerte montage'!B123","v":0},{"$f":"IF('Offerte montage'!I123=100,'Offerte montage'!J123,'Offerte montage'!C123)","v":""},"M",{"$f":"IF('Offerte montage'!I123=100,\"\",'Offerte montage'!J123)","v":0},null,{"$f":"IF(C201=\"G\",'Offerte goederen'!R123,IF(C201=\"M\",'Offerte montage'!L123,\"\"))","v":""},{"$f":"IF(C201=\"G\",'Offerte goederen'!S123,IF(C201=\"M\",'Offerte montage'!M123,\"\"))","v":""},null,{"$f":"IF(C201=\"G\",'Offerte goederen'!U123,IF(C201=\"M\",'Offerte montage'!O123,\"\"))","v":0},null,{"$f":"IF(C201=\"G\",'Offerte goederen'!W123,IF(C201=\"M\",'Offerte montage'!Q123,\"\"))","v":""},null,{"$f":"IF(C201=\"G\",'Offerte goederen'!Y123,IF(C201=\"M\",'Offerte montage'!S123,\"\"))","v":""}]
[{"$f":"'Offerte montage'!B124","v":0},{"$f":"IF('Offerte montage'!I124=100,'Offerte montage'!J124,'Offerte montage'!C124)","v":""},"M",{"$f":"IF('Offerte montage'!I124=100,\"\",'Offerte montage'!J124)","v":0},null,{"$f":"IF(C202=\"G\",'Offerte goederen'!R124,IF(C202=\"M\",'Offerte montage'!L124,\"\"))","v":""},{"$f":"IF(C202=\"G\",'Offerte goederen'!S124,IF(C202=\"M\",'Offerte montage'!M124,\"\"))","v":""},null,{"$f":"IF(C202=\"G\",'Offerte goederen'!U124,IF(C202=\"M\",'Offerte montage'!O124,\"\"))","v":0},null,{"$f":"IF(C202=\"G\",'Offerte goederen'!W124,IF(C202=\"M\",'Offerte montage'!Q124,\"\"))","v":""},null,{"$f":"IF(C202=\"G\",'Offerte goederen'!Y124,IF(C202=\"M\",'Offerte montage'!S124,\"\"))","v":""}]
[{"$f":"'Offerte montage'!B125","v":0},{"$f":"IF('Offerte montage'!I125=100,'Offerte montage'!J125,'Offerte montage'!C125)","v":""},"M",{"$f":"IF('Offerte montage'!I125=100,\"\",'Offerte montage'!J125)","v":0},null,{"$f":"IF(C203=\"G\",'Offerte goederen'!R125,IF(C203=\"M\",'Offerte montage'!L125,\"\"))","v":""},{"$f":"IF(C203=\"G\",'Offerte goederen'!S125,IF(C203=\"M\",'Offerte montage'!M125,\"\"))","v":""},null,{"$f":"IF(C203=\"G\",'Offerte goederen'!U125,IF(C203=\"M\",'Offerte montage'!O125,\"\"))","v":0},null,{"$f":"IF(C203=\"G\",'Offerte goederen'!W125,IF(C203=\"M\",'Offerte montage'!Q125,\"\"))","v":""},null,{"$f":"IF(C203=\"G\",'Offerte goederen'!Y125,IF(C203=\"M\",'Offerte montage'!S125,\"\"))","v":""}]
[null,null,null,null,null,null,null,null,null,null,{"$f":"SUM(K2:K203)","v":0},null,{"$f":"SUM(M2:M203)","v":0}]

{"sheet":"Factuurspec. aanbet.","index":11,"n_rows":24,"n_cols":14,"rows_kept":24,"cut":false,"hidden":true,"merged":[[10,9,10,11],[4,9,4,11],[5,9,5,11],[6,9,6,11],[8,9,8,11],[9,9,9,11],[21,1,21,2],[21,9,21,11],[12,9,12,11],[15,4,15,7],[15,9,15,11],[16,4,16,7],[16,9,16,11],[17,4,17,7],[17,9,17,11],[22,4,22,7],[22,9,22,11],[18,4,18,7],[18,9,18,11],[19,4,19,7],[19,9,19,11],[20,9,20,11]]}
[]
[null,null,"Factuurspecificatie (aanbetaling)"]
[null,null,null,null,null,null,null,null,4]
[]
[null,"Naam klant/contactpers.:",{"$f":"CONCATENATE(IF('Offerte goederen'!C5=0,\"\",'Offerte goederen'!C5),\" \",IF('Offerte goederen'!D5=0,\"\",'Offerte goederen'!D5),\" \",IF('Offerte goederen'!E5=0,\"\",'Offerte goederen'!E5))","v":"  "}]
[null,"Organisatie:",{"$f":"'Offerte goederen'!C6","v":0}]
[null,"Montage-adres:",{"$f":"'Offerte goederen'!C7","v":0}]
[null,"Postcode/Wplts.:",{"$f":"CONCATENATE(IF('Offerte goederen'!C8=0,\"\",'Offerte goederen'!C8),\" \",IF('Offerte goederen'!D8=0,\"\",'Offerte goederen'!D8))","v":" "}]
[null,"Land:",{"$f":"'Offerte goederen'!C9","v":0}]
[null,"E-mailadres:",{"$f":"'Offerte goederen'!C10","v":0}]
[]
[null,"Telefoon 1:",{"$f":"CONCATENATE(IF('Offerte goederen'!C12=0,\"\",CONCATENATE(\"+\",'Offerte goederen'!C12)),\" \",IF('Offerte goederen'!D12=0,\"\",'Offerte goederen'!D12))","v":" "}]
[null,"Telefoon 2:",{"$f":"CONCATENATE(IF('Offerte goederen'!C13=0,\"\",CONCATENATE(\"+\",'Offerte goederen'!C13)),\" \",IF('Offerte goederen'!D13=0,\"\",'Offerte goederen'!D13))","v":" "}]
[null,null,null,null,null,null,null,null,null,null,null,null,{"$f":"'Offerte totaal'!$M$14","v":"a"}]
[null,"Datum:",null,null,null,null,null,null,null,null,null,null,{"$f":"'Offerte totaal'!$M$15","v":true}]
[null,"Behorend bij fact.nr.:",null,null,{"$f":"'Offerte totaal'!E16","v":"Totaalbedrag (excl. BTW): "},null,null,null,null,{"$f":"'Offerte totaal'!J16","v":0},null,null,{"$f":"'Offerte totaal'!$M$16","v":"x"}]
[null,null,null,null,{"$f":"'Offerte totaal'!E17","v":""},null,null,null,null,{"$f":"'Offerte totaal'!J17","v":0}]
[null,"Projectomschrijving klant:",{"$f":"'Offerte goederen'!C18","v":0},null,{"$f":"'Offerte totaal'!E18","v":""},null,null,null,null,{"$f":"'Offerte totaal'!J18","v":0}]
[null,null,{"$f":"'Offerte goederen'!C19","v":0},null,{"$f":"'Offerte totaal'!E19","v":"+ BTW (21%): "},null,null,null,null,{"$f":"'Offerte totaal'!J19","v":0}]
[null,null,{"$f":"'Offerte goederen'!C20","v":0},null,{"$f":"'Offerte totaal'!E20","v":"Totaalbedrag (incl. BTW): "},null,null,null,null,{"$f":"'Offerte totaal'!J20","v":0}]
[null,null,null,null,null,null,"Aan te betalen o.b.v. een aanbetalingspercentage van: ",0.5,null,{"$f":"H21*J20","v":0}]
[]
[null,null,null,null,{"$f":"CONCATENATE(\"Aanbetalingsbedrag excl. € \",ROUND((Formulierdata!A29*J21),2),\" BTW: \")","v":"Aanbetalingsbedrag excl. € 0 BTW: "},null,null,null,null,{"$f":"J21-(Formulierdata!A29*J21)","v":0}]
[null,"Vertrek","Omschrijving (G = Goederen, M = Montage- en overige kosten)",null,"Toelichting (evt.)",null,{"$f":"'Offerte totaal'!G24","v":"Prijs       (excl. BTW)"},"per",null,"Aantal\neenh.",null,"Bedrag\n(excl. BTW)",null,"Bedrag\n(incl. BTW)"]

{"sheet":"Factuurspec. deel- of restbet.","index":12,"n_rows":24,"n_cols":14,"rows_kept":24,"cut":false,"hidden":true,"merged":[[10,9,10,11],[4,4,4,7],[4,9,4,11],[5,9,5,11],[6,9,6,11],[8,9,8,11],[9,9,9,11],[21,1,21,2],[21,9,21,11],[12,9,12,11],[15,4,15,7],[15,9,15,11],[16,4,16,7],[16,9,16,11],[17,4,17,7],[17,9,17,11],[22,4,22,7],[22,9,22,11],[20,4,20,7],[18,4,18,7],[18,9,18,11],[19,4,19,7],[19,9,19,11],[20,9,20,11]]}
[]
[null,null,"Factuurspecificatie (restbetaling)"]
[null,null,null,null,null,null,null,null,4]
[]
[null,"Naam klant/contactpers.:",{"$f":"CONCATENATE(IF('Offerte goederen'!C5=0,\"\",'Offerte goederen'!C5),\" \",IF('Offerte goederen'!D5=0,\"\",'Offerte goederen'!D5),\" \",IF('Offerte goederen'!E5=0,\"\",'Offerte goederen'!E5))","v":"  "},null,{"$f":"IF(Dossier!H18>0,\"Nog te factureren restbedrag (incl./excl. BTW): \",\"\")","v":""},null,null,null,null,{"$f":"IF(Dossier!H18>0,Dossier!H18,\"Volledig gefactureerd\")","v":"Volledig gefactureerd"},null,null,null,{"$f":"IF(J5=\"Volledig gefactureerd\",\"\",(1/(1+Formulierdata!A29))*J5)","v":""}]
[null,"Organisatie:",{"$f":"'Offerte goederen'!C6","v":0}]
[null,"Montage-adres:",{"$f":"'Offerte goederen'!C7","v":0}]
[null,"Postcode/Wplts.:",{"$f":"CONCATENATE(IF('Offerte goederen'!C8=0,\"\",'Offerte goederen'!C8),\" \",IF('Offerte goederen'!D8=0,\"\",'Offerte goederen'!D8))","v":" "}]
[null,"Land:",{"$f":"'Offerte goederen'!C9","v":0}]
[null,"E-mailadres:",{"$f":"'Offerte goederen'!C10","v":0}]
[]
[null,"Telefoon 1:",{"$f":"CONCATENATE(IF('Offerte goederen'!C12=0,\"\",CONCATENATE(\"+\",'Offerte goederen'!C12)),\" \",IF('Offerte goederen'!D12=0,\"\",'Offerte goederen'!D12))","v":" "}]
[null,"Telefoon 2:",{"$f":"CONCATENATE(IF('Offerte goederen'!C13=0,\"\",CONCATENATE(\"+\",'Offerte goederen'!C13)),\" \",IF('Offerte goederen'!D13=0,\"\",'Offerte goederen'!D13))","v":" "}]
[null,null,null,null,null,null,null,null,null,null,null,null,{"$f":"'Offerte totaal'!$M$14","v":"a"}]
[null,"Datum:",null,null,null,null,null,null,null,null,null,null,{"$f":"'Offerte totaal'!$M$15","v":true}]
[null,"Behorend bij fact.nr.:",null,null,{"$f":"IF(AND(M15=TRUE,M16=\"x\"),\"Totaalbedrag (excl. BTW): \",IF(M15=FALSE,\"Totaalbedrag (BTW verlegd): \",\"Totaalbedrag voor korting (excl. BTW): \"))","v":"Totaalbedrag (excl. BTW): "},null,null,null,null,{"$f":"SUBTOTAL(9,L25:L205)","v":0},null,null,{"$f":"'Offerte totaal'!$M$16","v":"x"}]
[null,null,null,null,{"$f":"IF(OR(M14=\"c\",M14=\"e\"),CONCATENATE(\"+ BTW (\",100*Formulierdata!A29,\"%): \"),IF(OR(M14=\"b\",M14=\"d\"),\"-/- Korting: \",\"\"))","v":""},null,null,null,null,{"$f":"IF(OR($M$14=\"c\",$M$14=\"e\"),Formulierdata!$A$29*'Offerte totaal'!$J$16,0)","v":0}]
[null,"Projectomschrijving klant:",{"$f":"'Offerte goederen'!C18","v":0},null,{"$f":"IF(OR(M14=\"b\",M14=\"d\"),\"Totaalbedrag na korting (excl. BTW): \",IF(OR(M14=\"c\",M14=\"e\"),\"Totaalbedrag voor korting (incl. BTW): \",\"\"))","v":""},null,null,null,null,{"$f":"IF(OR($M$14=\"a\",$M$14=\"f\",$M$14=\"g\",$M$14=\"h\",$M$14=\"i\",$M$14=\"j\"),$J$16,IF($M$14=\"b\",$J$16-$J$17,IF($M$14=\"d\",$J$16-($J$17*$J$16),IF(OR($M$14=\"c\",$M$14=\"e\"),$J$16+($J$16*Formulierdata!$A$29)))))","v":0}]
[null,null,{"$f":"'Offerte goederen'!C19","v":0},null,{"$f":"IF(OR(M14=\"a\",M14=\"b\",M14=\"d\"),CONCATENATE(\"+ BTW (\",100*Formulierdata!A29,\"%): \"),IF(OR(M14=\"c\",M14=\"e\",M14=\"g\",M14=\"h\",M14=\"i\",M14=\"j\"),\"-/- Korting: \",\"\"))","v":"+ BTW (21%): "},null,null,null,null,{"$f":"IF(OR($M$14=\"f\",$M$14=\"g\",$M$14=\"h\",$M$14=\"i\"),\"\",IF($M$14=\"a\",Formulierdata!$A$29*$J$16,IF(OR($M$14=\"b\",$M$14=\"d\"),Formulierdata!$A$29*$J$18,0)))","v":0}]
[null,null,{"$f":"'Offerte goederen'!C20","v":0},null,{"$f":"IF(OR(M14=\"b\",M14=\"d\",M14=\"c\",M14=\"e\"),\"Totaalbedrag na korting (incl. BTW): \",IF(M14=\"a\",\"Totaalbedrag (incl. BTW): \",IF(OR(M14=\"g\",M14=\"h\",M14=\"i\",M14=\"j\"),\"Totaalbedrag na korting (BTW verlegd): \",\"\")))","v":"Totaalbedrag (incl. BTW): "},null,null,null,null,{"$f":"IF(OR($M$14=\"a\",$M$14=\"b\",$M$14=\"d\"),$J$18+$J$19,IF(OR($M$14=\"c\",$M$14=\"g\", $M$14=\"h\"),$J$18-$J$19,IF(OR($M$14=\"e\",$M$14=\"i\",$M$14=\"j\"),$J$18-($J$19*$J$18),\"\")))","v":0}]
[null,null,null,null,{"$f":"CONCATENATE(\"waarover \",100*'Factuurspec. aanbet.'!H21,\"% aanbetaald: \")","v":"waarover 50% aanbetaald: "},null,null,null,null,{"$f":"'Factuurspec. aanbet.'!H21*'Factuurspec. deel- of restbet.'!J20","v":0}]
[]
[null,null,null,null,{"$f":"CONCATENATE(\"Te voldoen incl./excl. BTW (BTW-bedrag € \",ROUND(J23-N23,2),\"): \")","v":"Te voldoen incl./excl. BTW (BTW-bedrag € 0): "},null,null,null,null,{"$f":"J20-J21","v":0},null,null,null,{"$f":"(1/(1+Formulierdata!A29))*J23","v":0}]
[null,"Vertrek","Omschrijving (G = Goederen, M = Montage- en overige kosten)",null,"Toelichting (evt.)",null,"Prijs\n(excl. BTW)","per",null,"Aantal\neenh.",null,"Bedrag\n(excl. BTW)",null,"Bedrag\n(incl. BTW)"]

{"sheet":"Dossier","index":13,"n_rows":21,"n_cols":8,"rows_kept":21,"cut":false,"hidden":true,"merged":[]}
[]
[null,"Betalingsdossier"]
[]
[null,"Kortingsscenario (a t/m i):",{"$f":"'Offerte totaal'!M14","v":"a"},{"$f":"(CONCATENATE(\"= \",VLOOKUP(C4,D5:E14,2,FALSE)))","v":"= BTW berekenen, geen korting"}]
[null,null,null,"a","BTW berekenen, geen korting"]
[null,null,null,"b","BTW berekenen, korting in € vóór BTW"]
[null,null,null,"c","BTW berekenen, korting in € ná BTW"]
[null,null,null,"d","BTW berekenen, korting in % vóór BTW"]
[null,null,null,"e","BTW berekenen, korting in % ná BTW"]
[null,null,null,"f","BTW verlegd, geen korting"]
[null,null,null,"g","BTW verlegd, korting in € vóór BTW"]
[null,null,null,"h","BTW verlegd, korting in € ná BTW"]
[null,null,null,"i","BTW verlegd, korting in % vóór BTW"]
[null,null,null,"j","BTW verlegd, korting in % ná BTW"]
[]
[null,null,"Datum",{"$f":"'Offerte totaal'!E16","v":"Totaalbedrag (excl. BTW): "},{"$f":"'Offerte totaal'!E17","v":""},{"$f":"'Offerte totaal'!E18","v":""},{"$f":"'Offerte totaal'!E19","v":"+ BTW (21%): "},{"$f":"'Offerte totaal'!E20","v":"Totaalbedrag (incl. BTW): "}]
[null,"Laatste registratiedatum:",{"$f":"MAX(C19:C21)","v":"00:00:00"}]
[null,"Openstaand saldo:",null,null,null,null,null,{"$f":"H21-SUM(H19:H20)","v":0}]
[]
[null,"Aanbetalingsfactuur",null,null,null,null,null,{"$f":"'Factuurspec. aanbet.'!J21","v":0}]
[null,"Offerte",null,{"$f":"'Offerte totaal'!J16","v":0},{"$f":"'Offerte totaal'!J17","v":0},{"$f":"'Offerte totaal'!J18","v":0},{"$f":"'Offerte totaal'!J19","v":0},{"$f":"'Offerte totaal'!J20","v":0}]

{"sheet":"Formulierdata","index":14,"n_rows":29,"n_cols":11,"rows_kept":29,"cut":false,"hidden":true,"merged":[[1,3,1,14]]}
[]
[null,null,null,"Plaats de cursor op de juiste cel in de rij naar keuze, maar nooit op of rechts van de cel met de waarde 3einde lijst. Klik daarna op de knop \"Waarde toevoegen\". Plaats de nieuwe waarde in de lege cel, die links van de gekozen cel verschijnt."]
[]
["Aanhef"]
["Dhr.","Mevr.","Dhr. en mevr.","Fam."," 3einde lijst"]
["Artikelomschrijving"]
["Gordijn","Vouwgordijn","Rolgordijn","Inbetween","Duette","Plissé","Jaloezie","Lamellen","Rail","Overig"," 3einde lijst"]
["Strak/Blijvend"]
["Strak","Blijvend"," 3einde lijst"]
["Stel/Stuk"]
["Stel","Stuk","Stuk L","Stuk R","Stuk M"," 3einde lijst"]
["Plooi"]
["Enkel","Dubbel","Triple","Dubb. ret.","Wave"," 3einde lijst"]
["Railtype"]
["KS","DS","IS Square","IS Round 20","IS Round 22","IS Round 25","IS Flat"," 3einde lijst"]
["Railkleur"]
["Wit (50)","Zwart (56)","Alu (79)","Edelstaal (77)","Nikkel mat (72)","Brons (80)","Chroom (70)","Messing (60)","Antractiet (51)"," 3einde lijst"]
["Bevestiging"]
["Wand","Plafond"," 3einde lijst"]
["Materiaal"]
["Hout","Beton","Gips","Alum."," 3einde lijst"]
["Bediening"]
["Links","Rechts","Midden"," 3einde lijst"]
["Hoofdje"]
[0.5,1,1.5,2," 3einde lijst"]
["Prijseenheid"]
["/m","/m2","/st","/u","/km",null," 3einde lijst"]
["BTW"]
[0.21," 3einde lijst"]

{"sheet":"Klantdata","index":15,"n_rows":545,"n_cols":8,"rows_kept":545,"cut":false,"hidden":true,"merged":[]}
["Klantcode","Naam","Contactpersoon","Postcode","Plaats","Telefoon","Mobiel","E-mail"]
[544,"EBN Certification BV","Cock van Zwienen","3316KG","Dordrecht","078-2003400","06-50655645","cvz@ebncertification.nl"]
[543,"Cheryll Verhoeven",null,"5617 AR","Eindhoven",null,null,"verhoeven.cs@gmail.com"]
[542,"Andre Rutjens",null,"6026CG","Maarheeze",null,null,""]
[541,"Keijsers Interiors","Hans Smetsers","5961PT","Horst","077-3974100","","facturen@keijsersinteriors.com"]
[540,"Infinity Print","Bas Stribos","56178AC","Eindhoven","","","bas@infinityprint.nl"]
[539,"Fam. van Kruijsdijk",null,"5623KW","Eindhoven",null,null,""]
[538,"Frank en Patricia Bornebroek",null,"5615JL","Eindhoven",null,null,""]
[537,"Atelier Linesse","","B3500","Hasselt","","",""]
[536,"Ginny Snippe",null,"6171AH","Stein",null,null,""]
[535,"Architectenburo Franken",null,"5571","Bergeijk",null,null,""]
[534,"Ijzendoorn",null,"5506GE","Veldhoven"]
[533,"Dhr.Jo Fievez",null,"6216AG","Maastricht",null,null,""]
[532,"Ruud Berkvens",null,"5722AA","Asten",null,null,""]
[531,"Henk van der Straaten",null,"5831RB","Boxmeer",null,null,""]
[530,"Lab NG","Gemma Tersteeg","6228SE","Maastricht","","0621916720","gemma@labng.nl"]
[529,"Rene En Mirthe Vegter",null,"6006SK","Weert",null,null,""]
[528,"Soraya Viana",null,"5642AD","Eindhoven",null,null,""]
[527,"Verscheijden",null,"6002CM","Weert",null,null,""]
[526,"Slenders Footcare & cosmetics","Ronald Wagtere","5563CL","Westerhoven","0628486520","","inkoop@slendersbeauty.nl"]
[525,"Tandarts Praktijk Asten","Linda Izhak","5721 GM","Asten","0493-380533","","info@tandartspraktijkasten.nl"]
[524,"Dhr. Mevr, Karin Fase",null,"5667JE","Geldrop",null,null,""]
[523,"Dhr. Burcin Colak",null,"6006 HW","Weert",null,null,""]
[522,"Dhr./Mevr. Peters","","3871XD","Hoevelaken","","0655736130","gondapeters@kpnmail.nl"]
[521,"Dhr. Ton Koster","","5711NB","Someren","0646121375","","koster.ton@gmail.com"]
[520,"Dhr.Thijs Retera","","B3930","Achel","06-28610548","","thijsenjudith@hotmail.com"]
[519,"Dhr. Richard Reijven",null,"6013RS","Hunsel",null,null,""]
[518,"Van der Meeren Vastgoed B.V.",null,"5616 RT","Eindhoven",null,null,""]
[517,"Studio Lef","","6026BL","Maarheeze","0644022666","","danielle@studio-lef.com"]
[516,"Dhr./Mevr. Keller",null,"5667 PD","Geldrop",null,null,""]
[515,"Landgoed Leudal","","6081NT","Haelen","","","henny@landgoedleudal.nl"]
[514,"B.E.E.M. van den Borne PWBV","Ben van den Borne","5623 EJ","Eindhoven"]
[513,"Enginia ",null,"7556BN","Hengelo"]
[512,"Ruggensteun Chiropracteur","dhr. Stas","5613GA","Eindhoven"]
[511,"Edstylio","Edith van Ham","5554JL","Valkenswaard"]
[510,"Ton Projectstoffering Bv","Ton","5741PP","Beek en Donk"]
[509,"Mevr. C. Krijger",null,"5554PS","Valkenswaard"]
[508,"Dhr. P Kuhn",null,"5735KN","Aarle Rixtel"]
[507,"Sereen","Caroline Wolterink","5554AC","Valkenswaard"]
[506,"Dhr./Mevr. Arends",null,"5553CE","Valkenswaard"]
[505,"Dhr. D. Jansen",null,"5688GB","Eindhoven"]
[504,"Hal 2","Bart Waasdorp","5615PP","Eindhoven"]
[503,"Joost en Valery Bartels",null,"5674AE","Nuenen"]
[502,"Mevr. Betty van Helden",null,"2803 JX","Gouda"]
[501,"Ton Beekmans en Ans van Eijndhoven",null,"5298PB","Liempde"]
[500,"Lew Interieur","Fleur Lew","3571BL","Utrecht"]
[499,"dhr./Mevr M. Vos",null,"5375 KN","Reek"]
[498,"Mevr. D. Cortenbach",null,"6001GC","Weert"]
[497,"Dhr./Mevr. vd Veerdonk - Nijhuis",null,"5667PD","Geldrop"]
[496,"D. Molenbroek",null,"5508WC","Veldhoven"]
[495,"@my Support","Amy Colsters van Bijsterveldt","5091RR","Oostelbeers"]
[494,"Amy Colsters Bijsterveld",null,"5091 RR","Oostelbeers"]
[493,"Priscilla Roovers",null,"5473 AW","Heeswijk Dinther"]
[492,"Mark en Esther van Zon",null,"6026CW","Maarheeze"]
[491,"Bram Schellens",null,"5554 PB","Valkenswaard"]
[490,"Dhr. J. Lange",null,"6603JV","Wijchen"]
[489,"Toon en Kristel van Moorsel",null,"5666BW","Geldrop"]
[488,"Toon van Moorsel Beheer BV","Toon van Moorsel","5666BW","Geldrop"]
[487,"Hofman",null,"5691PA","Son en Breugel"]
[486,"Fran vd Broek",null,"6026BW","Maarheeze"]
[485,"Niels Groenen",null,"3527 HJ","Utrecht"]
[484,"Rafael Viana Ferreiro",null,"6001GJ","Weert"]
[483,"Mevr. Jet de Proost",null,"5611 KT","Eindhoven"]
[482,"Casual Sport","Ingrid Brankaert","6021 PT","Budel  "]
[481,"Dhr. H.Droppert","","5708HN","Helmond"]
[480,"Dhr./Mevr. B. Blijs",null,"5688KC","Oirschot"]
[479,"Davy de Vries",null,"5247 HA","Rosmalen"]
[478,"Pierre van der Sanden",null,"5616EL","Eindhoven"]
[477,"Hans Smetsers",null,"5508 EE","Veldhoven"]
[476,"Heerkens van Bavel Bouw BV",null,"5000AA","Tilburg"]
[475,"Eyck",null,"5642 JB","Eindhoven"]
[474,"Paul vd Weijer",null,"5583TD","Waalre"]
[473,"WDMvdVen","Wietse","6026BW","Maarheeze"]
[472,"Imming Tegelsalon","tom","5652AK","Eindhoven"]
[471,"Tegelsalon Imming","Tom","5652AK","Eindhoven"]
[470,"Dhr./Mevr. Van Asten","","5591HW","Heezew"]
[469,"Bram Van Dooren","","6005RH","Weert"]
[468,"P van de Laar",null,"5611 VA","Eindhoven"]
[467,"Landelijk at home","Willianne ","5688AJ","Oirschot","","0651119156"]
[466,"Dhr/Mevr v Asten",null,"5591 HW","Heeze"]
[465,"Muurbloem werken B.V.","Bart van de Kerkhof","3515 EJ","Utrecht","030-2714014","06-13356863","bart@muurbloem.com"]
[464,"Outrance Interiors","Melanie van der Steen","B1860","Meise"]
[463,"Danny en Henny Wessels Bruinewold",null,"5611 VW","Eindhoven"]
[462,"Hotel Barefood Guilia","Mevr M. Blonda - Miermans","3500","Hasselt","003211933380",null,"info@barefoodguilia,be"]
[461,"Fam. Seuntjes",null,"5531 KB","Bladel"]
[460,"Chu Exploitatie BV","Dhr. J Qu","1054 GE","Amsterdam"]
[459,"Puur Sang","Rob Clerkx en Mous Yuen","5642 JM","Eindhoven"]
[458,"Q-dent",null,"B2180","Ekeren"]
[457,"Fam. Quisquater",null,"B2270","Herenthout"]
[456,"Jason Williams",null,"5692VG","Son en Breugel"]
[455,"Fam. van Mierlo",null,"6027 NC","Soerendonk"]
[454,"Fam. Joosen-Wijnen",null,"4844 PK","Terheijden"]
[453,"Merel Vlerken ",null,"5731 AN","Mierlo"]
[452,"Dhr. A Vermeulen",null,"B1000"," Brussel"]
[451,"Wim Hillenbrink",null,"5801HX","Venray"]
[450,"Stefan en Tanja Nijsen",null,"6021 NC","Budel"]
[449,"De Kleurenkamer",null,"5682 CA","Best"]
[448,"QLYX Projecten BV","Adrie Jansen","5145 PE","Waalwijk"]
[447,"Eshter en Jens van Son","Eshter en Jens van Son","5581 HE","Waalre"]
[446,"Fam. Rosenau-Michiels","","B3920","Lommel"]
[445,"Marc van Heuven","Marc van Heuven","5672 TP","Nuenen"]
[444,"Lars Kip","Lars Kip","5509 NV","Veldhoven"]
[443,"Bianca de Winter ",null,"5731CJ","Mierlo"]
[442,"Fam. van Leuken",null,"6021 KL","Budel"]
[441,"Maarten en Wendy van Esch",null,"5688 EJ","Oirschot"]
[440,"2 Decorate","Liesl Snyder","3600","Genk"]
[439,"Mevr. Quan Li",null,"6002 CL","Weert"]
[438,"Veiligheidsregio Brabant  zuid oost","Rudolf van den nieuwenhof","5611 KX","Eindhoven"]
[437,"Dhr. Robin Gense",null,"5091 GR","Middelbeers"]
[436,"Hans en Vivian vd Berg Berden",null,"6004 ET","Weert"]
[435,"Mevr. Ellen Hollander",null,"5629 ND","Eindhoven"]
[434,"Ruud Sleenhoff",null,"5611 LH","Eindhoven"]
[433,"Dhr./Mevr. Basemans",null,"5666SC","Geldrop"]
[432,"Joost Craenen",null,"5643 JL ","Eindhoven"]
[431,"Fam. Hanegraaf",null,"5667 RA","Geldrop"]
[430,"TVM Managment","Kristel van Moorsel","5666 BW","Geldrop"]
[429,"Chantal Keulen",null,"5501 AN","Veldhoven"]
[428,"SZ-Interieurs","Monique Szalai","5623MD","Eindhoven"]
[427,"Rens Feijen",null,"5555KZ","Valkenswaard"]
[426,"Mevr. Lieke Weerdenburg",null,"5642 JB","Eindhoven"]
[425,"Ankie Keeris",null,"5502 TC","Veldhoven"]
[424,"Tandtechniek Rosmalen","Jack de Win","5242 JT","Rosmalen"]
[423,"Emac bedrijfsadvies","Ingrid de Louw","5751 JN","Deurne"]
[422,"Mevr. Natasha Kolsteren",null,"6026 ED","Maarheeze"]
[421,"Muridee","Gunther Slaets","8930","Menen"]
[420,"Dhr./Mevr. de Win",null,"6026BM","Maarheeze"]
[419,"Huis van de stad Culemborg","Dhr. Tom Ketting","4101 BW","Culemborg"]
[418,"Geraats- Vleeshouwers",null,"6003 PE","Weert"]
[417,"Fam. van de Voort ",null,"5091 GP","Middelbeers"]
[416,"Martine van Campen",null,"4837 CV","Breda"]
[415,"Spaan Projecten stoffering BV","Henry Spaan","5661 NG","Geldrop"]
[414,"Beerten Bedrijfsruimtes","Frank Beerten","6023RB ","Budel Schoot"]
[413,"Ruud Interieur ontwerp","Ruud","5622 KX","Eindhoven"]
[412,"Veldeman Bedding NV","Kristoff Cuppens","3660","Opglabbeek (België)"]
[411,"Mevr. Anneli Chatrou",null,"5644 GJ","Eindhoven"]
[410,"Mevr. Yvon Wolfs",null,"5044 RA","Tilburg"]
[409,"Sven en Miranda Rem",null,"4161DD","Heukelum"]
[408,"Brugmans Groep","Ron Snoeren","5665 TA","Veghel","","",""]
[407,"Hentex","Harrie Hendriks","5667 KW","Geldrop"]
[406,"Fahrida Johri",null,"5261 CJ","Vught"]
[405,"Dhr. Spierings",null,"6024 BC"," Budel-Dorplein"]
[404,"Senzer ","dhr. R. Spierings","5705 AK","Helmond"]
[403,"Dhr. John Hoeben",null,"6035 RJ","Ospel"]
[402,"Mevr. Ans Habdank",null,"6372 BN","Landgraaf"]
[401,"Dhr. van den Berg",null,"5341 BC","Oss"]
[400,"Dhr./Mevr. Krieckaert","","5591 TP","Heeze"]
[399,"Mevr. van Thiel",null,"5508 AX","Veldhoven"]
[398,"van Gameren",null,"3541 RB","Utrecht"]
[397,"dhr. van Amelsfort",null,"5644 DV","Eindhoven"]
[396,"Martin Daudey",null,"6026 DH","Maarheeze"]
[395,"Exclusive Drivers",null,"5591 TR","Heeze"]
[394,"dhr. L. van den Adel",null,"6901 HH","Zevenaar"]
[393,"Dhr. Bommezijn","","5655 CC","Eindhoven"]
[392,"Mevr. Gabby Schuttenbelt",null,"6213 CW","Maastricht"]
[391,"Mevr. Hendriks","","6216 RN","Maastricht"]
[390,"Dhr. J. Ebbers",null,"6132 ET","Sittard"]
[389,"Joris van Houte",null,"5671 AT","Nuenen"]
[388,"Schepers",null,"5706 HH","Helmond"]
[387,"Mevr. Mommersteeg",null,"4625 ET","Bergen op Zoom"]
[386,"Mevr. Arienne Deurloo",null,"6224 HM","Maastricht"]
[385,"Dhr./Mevr. van Hunsel",null,"6021 AG","Budel"]
[384,"Dhr./Mevr. Wouters",null,"5091 GS","Middelbeers"]
[383,"Paul Sebregt",null,"B2460","Kasterlee"]
[382,"Mevr. Marlies Consten",null,"6367 VH","Voerendaal"]
[381,"Fam. Kauffmann",null,"6026VV","Maarheeze"]
[380,"Mevr. Maud van Geffen",null,"5672 AL","Nuenen"]
[379,"Mevr. van Gerwen",null,"5658 BZ","Eindhoven"]
[378,"Mevr. Sylvia Visser",null,"4161 BS","Heukelum"]
[377,"Mevr. Nicole Broers",null,"6021 AD","Budel"]
[376,"Damian Kaczmarska",null,"5864 EC","Meerlo"]
[375,"Studio LIV","Linda Verlouw","5331 BL","Kerkdriel"]
[374,"Lindsay van Kemenade",null,"5503 SJ","Veldhoven"]
[373,"N-APK","Esmee Beschtold","6114 BC","Susteren"]
[372,"Anne Maaskant",null,"5671 GN","Nuenen"]
[371,"Maik der Kinderen",null,"5611 WE","Eindhoven"]
[370,"Bart Levels",null,"6028 RR","Gastel"]
[369,"h2o Sports","Paul Vleerbos","3853 LB","Ermelo"]
[368,"Bernard Maas",null,"B3910","Neerpelt"]
[367,"van Wageningen ","Gerrit en Ellen ","5651 GE","Eindhoven"]
[366,"Tim-Recruitment","Tim Bijnen","5582 LA","Waalre"]
[365,"Mevr. Vicky van Kerckhove",null,"5463LG","Veghel"]
[364,"Mevr. I. Spooren",null,"5708 TE","Helmond"]
[363,"Mevr. A.Leemans",null,"5223 MC","Den Bosch"]
[362,"Dhr./Mevr. Bakkes",null,"6021 LT","Budel"]
[360,"Hotel Botticelli","Dhr. Charles Steffens","6211 LG","Maastricht"]
[359,"Stichting 12 Stappen","Ron van Breemen","1032 KK","Amsterdam"]
[358,"Apotheek Mierlo","R. Heijnsbroek","5731 EG","Mierlo"]
[357,"American Dental Trading BV","Bas V Gorp","5061 JR","Oisterwijk"]
[356,"Dhr./Mevr. Bouwma",null,"6021 DA","Budel"]
[355,"Jan Bours",null,"6129 PT","Urmond"]
[354,"Fam. Tsoutsanis van Dijk",null,"2553 DA","Den Haag"]
[353,"Marc van Heumen",null,"5672 TP","Nuenen"]
[352,"Dhr. L.Sanders en Mevr. S.Molenbroek",null,"6026 BM","Maarheeze"]
[351,"Dhr. N. Britstra",null,"5658 PK","Eindhoven"]
[350,"Dhr./Mevr. H.W.B. Visser",null,"4161 BZ","Heukelum"]
[349,"Dhr./Mevr. E. Klaassens",null,"5613 AC","Eindhoven"]
[348,"Dhr. J.Langhout",null,"4835 BE","Breda"]
[347,"MGB graphic specials","Dhr. Alex Grijmans","6003 CH","Weert"]
[346,"Mevr. M. Toet",null,"5673 BZ","Nuenen"]
[345,"Fa. Nooijen Betonpompen","dhr. Henry Beekman","5464 TJ","Veghel"]
[344,"Dhr. P.Krempel",null,"4837 EC","Breda"]
[343,"Mevr. P.Bex",null,"6225 XZ","Maastricht"]
[342,"Dhr. J. Wijnen",null,"5508 LJ","Veldhoven"]
[341,"Dhr./Mevr. H. Roovert",null,"5091 EZ","Middelbeers"]
[340,"Mevr. Rietbergen",null,"5629NL","Eindhoven"]
[339,"Mevr. Laura van Bree","","6015RD","Neerritter"]
[338,"Pollard Jachtbouw","Henk Jan","8331 VD","Steenwijk"]
[337,"Dhr./Mevr. M. Visser",null,"4161 DD","Heukelom"]
[336,"Dhr./Mevr. J. Roovert",null,"5091 AA","Middelbeers"]
[335,"Mevr.A. van der Straaten",null,"5666 EH ","Geldrop"]
[334,"Apotheek de Locht",null,"5504 HH","Veldhoven"]
[333,"Mevr. Shelley Kil",null,"6462 GE","Kerkrade"]
[332,"PreVision","Inge van der Zanden","5611 NA","Eindhoven"]
[331,"Dhr. P.Geboerrs",null,"5591 ND","Heeze"]
[330,"Dhr./Mevr. Tromp",null,"5554 MA","Valkenswaard"]
[329,"Dhr. Tim Philippen",null,"6373 VK","Landgraaf"]
[328,"Dhr./Mevr. Zijlker",null,"5614 GE","Eindhoven"]
[327,"C.W.J. Schreuders Beheer BV",null,"3997 ML","'t Goy"]
[326,"Mevr. Lingg",null,"5721 WK","Asten"]
[325,"Mevr. van het Hul",null,"5502DA","Veldhoven"]
[324,"Dhr. Jac Jongmans",null,"4706 BN","Roosendaal"]
[323,"Dhr. H.Vermulst",null,"5673LD","Nuenen"]
[322,"Dhr.A. Batterink",null,"5581 WC","Waalre"]
[321,"Mevr. Gerry Roovers",null,"B3930","Achel (België)"]
[320,"Notariskantoor van Luijn",null,"5682 BA","Best"]
[319,"Dhr./Mevr. Tijsen",null,"6021 KL","Budel"]
[318,"Maatman Zorggroep BV","Dhr. Maatman","6000 AG","Weert"]
[317,"Dhr./Mevr. Hoppzak",null,"5944 AG","Arcen"]
[316,"Aad en Ria Trompert",null,"3817 CA","Amersfoort"]
[315,"ECCO Leather BV","Jenny den Ronden","5107 NL","Dongen"]
[314,"Dhr./Mevr. Roovert",null,"5091 DJ","Oostelbeers"]
[313,"Mevr. Sijmens",null,"5708 AR","Helmond"]
[312,"Dhr./Mevr. van Dorst",null,"5706 PZ","Helmond"]
[311,"Dhr./Mevr. Egelmeers",null,"5507 KC","Veldhoven"]
[310,"van de Meeren",null,"5674 PJ","Nuenen"]
[309,"Verheijen Verf en Wand",null,"5752 BB","Deurne"]
[308,"Tjeerd van Wageningen",null,"5616  SN","Eindhoven"]
[307,"Dhr.P.Hanenberg",null,"5591 DZ","Heeze"]
[306,"Dhr. Gerbert Smulders",null,"5283 TZ","Boxtel"]
[305,"Mevr. Kathy Haans",null,"5731 ZL","Mierlo"]
[304,"Justin en Marcelle Stokx",null,"6026 DR","Maarheeze"]
[303,"Dhr./mevr. Beerten",null,"6023 RB","Budel-Schoot"]
[302,"Dhr. Johan Kamsteeg",null,"4706 KS","Roosendaal"]
[301,"Vunderink Projectzonwering BV",null,"5246 JJ","Den Bosch"]
[300,"Dhr. R. van de Ven- Luttmer",null,"5694 TL","Son en Breugel"]
[299,"Dhr.C. Gorgels",null,"6211 RN","Maastricht"]
[298,"stichting Stephanushof","Dhr. Beekmans","6097 EZ","Heel"]
[297,"Mart Lamers",null,"B3930","Hamont"]
[296,"Dhr.V. Hoop",null,"5623 KW","Eindhoven"]
[295,"Mevr. M.`van Reusel",null,"5623 GL","Eindhoven"]
[294,"Tegelsalon Imming","Tom Imming","5652 AJ","Eindhoven"]
[293,"Mevr.Toos Kivits",null,"5061 WL","Oisterwijk"]
[292,"Dhr. E.Keijzer",null,"5624 JL","Eindhoven"]
[291,"Dhr. D. vanOsch",null,"5751 VP","Deurne"]
[290,"Dhr.J.Smits",null,"6415 XB","Heerlen"]
[289,"Dhr. E.Lippens / Mevr.S. van Berkel",null,"3816 SB","Amersfoort"]
[288,"MEDAP Fusiotherapie","Dhr. S. Verberk","5025 SZ","Tilburg"]
[287,"Dhr. Erich Mauricio",null,"5665 SZ","Geldrop"]
[286,"Mevr. Ans Claesen","","5044 AJ","Tilburg"]
[285,"Dhr, W.Eerdekens en Mevr.E. Vangerven",null,"B3910","Neerpelt"]
[284,"Dhr. A.Korting",null,"5641 AN","Eindhoven"]
[283,"Dhr./Mevr. Latour",null,"5627PT","Eindhoven"]
[282,"Mevr. C. van den Bogaard",null,"5221 LT","Den Bosch"]
[281,"Mevr. Desiree Jans",null,"6132 BT","Sittard"]
[280,"Bart Volman",null,"5507 MX","Veldhoven"]
[279,"Recourt","Ilse","6026 AJ","Maarheeze"]
[278,"Jan Berkvens",null,"5721 JA","Asten"]
[277,"Wiriantora B.V.",null,"5541 CV","Reusel"]
[276,"Linda Kemeling",null,"5632 DZ","Eindhoven"]
[275,"Mevr. R. Wijnands",null,"5931 PD","Tegelen"]
[274,"Dhr. A.Smelzer",null,"5595 GN","Leende"]
[273,"mevr. Joke Janssen","","5735 EN","Aarle Rixtel"]
[272,"Kobefab International B.V.","Tim van der Stek","5555 XP","Valkenswaard"]
[271,"Partytenten Discounter","W.M. Vervaart","4879 NB","Etten Leur"]
[270,"Blok Social Society","Patrick Leenen","5807 AD","Oostrum"]
[269,"Maasdijk",null,"6105 CG","Maria Hoop"]
[268,"Mevr. Nadia Tsouli","","4611 JJ","Bergen op Zoom"]
[267,"Dhr./Mevr Slot",null,"2312 KJ","Leiden"]
[266,"de Roos Schoenen","","4818 JA","Breda"]
[265,"Makito Western Europe",null,"5671 AR","Nuenen"]
[264,"L.Tsai",null,"5623 BE","Eindhoven"]
[263,"Wendy en Ralf Schroder",null,"5521 TR","Eersel"]
[262,"Mevrouw W. Benders",null,"5711 TN","Someren"]
[261,"Mevr. Hetty Koumans",null,"6114 GG","Susteren"]
[260,"Maria den Boef",null,"4921 ZZ","Made"]
[259,"Dhr./Mevr. van der Aalst",null,"5507 KV","Veldhoven"]
[258,"Vialle",null,"5508 DZ","Veldhoven"]
[257,"H.Hilberink","","5664GM ","Geldrop"]
[256,"Dani Roahl","","4702TG ","Roosendaal"]
[255,"Mevr. Conny den Daas",null,"6026 VC","Maarheeze"]
[254,"Mevr. Annemie Jacobs",null,"5931 PV","Tegelen"]
[253,"Praktijk Vlotstraat ","mevr. S. Mullges","6411 EG","Heerlen"]
[252,"Ellen van der Boom","","3328 CM","Dordrecht"]
[251,"Leo Claassen",null,"5011 JW","Tilburg"]
[250,"Paal",null,"5591JH","Heeze"]
[249,"Mevr. B.Fernhout",null,"6411 MB","Heerlen"]
[248,"Stefan Fritsche",null,"5623 AB","Eindhoven"]
[247,"W.Boodee",null,"5709 PE","Helmond"]
[246,"Regionaal Instituut voor Dyslexie","Kim Huiskamp","6221 BT","Maastricht"]
[245,"Ronald Scipio",null,"6373 CW","Landgraaf"]
[244,"Dhr./Mevr. de Jong",null,"5032 ZA","Tilburg"]
[243,"Denise Kip",null,"5091 DH","Oostelbeers"]
[242,"Brohm",null,"3544 RH","Utrecht"]
[241,"Dhr./Mevr. Schellekens",null,"5126 WS","Gilze"]
[240,"Eliëns interieur projecten BV","Hans Smetsers","5652 AJ","Eindhoven"]
[239,"Bep van Berne",null,"5022 PH","Tilburg"]
[238,"van den Broek",null,"5702 AZ","Helmond"]
[237,"Jean Schillings","","6214 VV","Maastricht"]
[236,"M. Brugman",null,"4707 CS","Roosendaal"]
[235,"Mevr. Mourillon",null,"5051 ER","Goirle"]
[234,"Van der Sande",null,"6027 PR","Soerendonk"]
[233,"Dhr. Musch",null,"5623 KP"]
[232,"Mevr. J. Kuijlen",null,"5246 CJ","Rosmalen"]
[231,"Ralph Peeters",null,"5924 VP","Venlo"]
[230,"Stigter",null,"5835 CA","Beugen"]
[229,"Sistermans",null,"6228 DH","Maastricht"]
[228,"Tritium Advies BV","Mevr. Monique Bahangue","5674 TE","Nuenen"]
[227,"H.Mulder",null,"5611 LE ","Eindhoven"]
[226,"Vos","Jolanda","5142 AG","Waalwijk"]
[225,"Thomassen",null,"5927 PN ","Venlo"]
[224,"Atlant Groep","Ronald Kip","5700 AG","Helmond"]
[223,"Conline Coatings BV","Peter van 't Hart","4780 AB","Moerdijk"]
[222,"Hugo Cysouw",null,"2012 PA","Haarlem"]
[221,"PCH Beheer B.V.","Dhr. T.Sevenich","5911 KJ","Venlo"]
[220,"Remmers",null,"5591 NG","Heeze"]
[219,"Vorstenbosch",null,"5591 HZ","Heeze"]
[218,"j. Burghouts",null,"5644 BW","Eindhoven"]
[217,"Jacques Sol",null,"6021 JP","Bude;"]
[216,"P.Voets",null,"5663 SR","Geldrop"]
[215,"Ian Kleuskens",null,"6412 AD","Heerlen"]
[214,"Chinees Restaurant Tong Ah","dhr. Tuihu Hu","5671 GB","Nuenen"]
[213,"Ad van Liempd",null,"5481 SM","Schijndel"]
[212,"Marion Howe",null,"6026 SL","Maarheeze"]
[211,"Bas Vugts",null,"6024 AW","Budel-Dorpplein"]
[210,"Van den Heuvel",null,"5651 HE","Eindhoven"]
[209,"Luis Teixeira",null,"5652 RG","Eindhoven"]
[208,"Snepvangers",null,"4872 CD","Etten Leur"]
[207,"RCM Klussenbedrijf",null,"5663 RA","Geldrop"]
[206,"Ricardo Pinxt",null,"6245 KN","Eijsden"]
[205,"J.van Maris",null,"5616 SC","Eindhoven"]
[204,"Bannet","","5233 EG","Den Bosch"]
[203,"B.B.V. Achter de Haesen","John Zee","6372 GP","Landgraaf"]
[202,"De Bruin",null,"5707 BG","Helmond"]
[201,"Ramon Tull",null,"5623 DC","Eindhoven"]
[200,"Bogers",null,"5623 NC","Eindhoven"]
[199,"Best Point","Francis Limpens","6026 PR","Best"]
[198,"CMNTY","Ingrid Schram","5611 HA ","Eindhoven"]
[197,"Creusen",null,"6231 HN","Meerssen"]
[196,"Theunissen",null,"6132 BV ","Sittard"]
[195,"Dhr./Mevr. T.Delahay- van Bragt",null,"5664 XE","Geldrop"]
[194,"Bart Koolen",null,"5553 BA","Valkenswaard"]
[193,"B van Tilburg",null,"4623 XX","Bergen op Zoom"]
[192,"Josca van Dongen",null,"5921 XW","Venlo"]
[191,"Bus",null,"6603 JV","Wijchen"]
[190,"Jansen",null,"6603 JV ","Wijchen"]
[189,"de Bruijn",null,"6543 KA ","Nijmegen"]
[188,"Badenbroek",null,"5551 HT","Dommelen"]
[187,"Van Stokrom",null,"5655 JD","Eindhoven"]
[186,"Cijsouw",null,"5509 KC ","Veldhoven"]
[185,"Bukkems",null,"5751 AS","Deurne"]
[184,"Arthur Arthur","Dhr.M.Jansen","4818 AC ","Breda"]
[183,"Kuijpers",null,"5658 BK","Eindhoven"]
[182,"Jachtwef Vennekens b.v.b.a.","Stefan Vennekens","2850","Boom"]
[181,"woningstichting St .Joseph","Paul Sebregts","6039 CA","Stramproy"]
[180,"Arthur la Rose",null,"6417 AN ","Heerlen"]
[179,"van der Linden",null,"5642  RC","Eindhoven"]
[178,"Dutch Falcon Yachts ","Bram Kooltjes","5145 PD","Waalwijk"]
[177,"Mevr. Carla Cheizoo",null,"5043 BN","Tilburg"]
[176,"Cortenbach",null,"5591 ML"," Heeze"]
[175,"Schatteman ",null,"5694 VL","Son en Breugel"]
[174,"R.Cramer",null,"5506 GJ","Veldhoven"]
[173,"Hans en Petra Ummels",null,"6021 JW","Budel"]
[172,"Luijten Advocaten","Rob Luijten","6411 GB","Heerlen"]
[171,"Nacco Materials Handling Group BV","J.Smit","6541 CV ","Nijmegen"]
[170,"Visser",null,"5663 GG","Geldrop"]
[169,"R. Radestake",null,"6002 CK","Weert"]
[168,"BVBA Sterckenburgh","Marc van Kruysdijk","3990","Peer"]
[167,"Wagemakers",null,"4615 DB","Bergen op Zoom"]
[166,"B.Kaag",null,"6416 HH","Heerlen"]
[165,"Ankara Im-Export","Ismail Temizkan","5705 CH","Helmond"]
[164,"Dhr. Ties Noteboom",null,"5706 VG","Helmond"]
[163,"Vos","Marjo Vos","6221 XG","Maastricht"]
[162,"de Vries-Bouchee",null,"5658 HT","Eindhoven"]
[161,"Mevr. Myra Rulo ",null,"5673 TN","Nuenen"]
[160,"Gordijn Atelier Romeo en Juliette","Berdie van Grinsven","5731 BE","Helmond"]
[159,"Mols",null,"5671 HE","Nuenen"]
[158,"Wollenberg",null,"6021 EE","Budel"]
[157,"Eddie Klippert",null,"6245 PT","Eijsden"]
[156,"Smits-Staals",null,"5555 XG","Valkenswaard"]
[155,"Boeren",null,"5328 CG","Rossum"]
[154,"Boer",null,"6226 WZ","Maastricht"]
[153,"Jacobs",null,"6011 RA","Ell"]
[152,"The Concept Store","René van de Mortel","5643 LM","Eindhoven"]
[151,"Q-wick","Wick","5624 AW","Eindhoven"]
[150,"MTS Schoone",null,"5595 XL","Leende"]
[149,"Dhr. M.C.Bogers ",null,"5623 NB","Eindhoven",null,"06-54713670"]
[148,"Paul Berden",null,"1788 ZH","Julianadorp"]
[147,"Driessen Interieur","Sandra v/d Burgt","5707 AP","Helmond"]
[146,"B. Koolen",null,"5553 BA","Valkenswaard"]
[145,"'t Trepke","Gert Mollen","6026 XN","Maarheeze"]
[144,"Byelex Solutions BV","Roland Duiker","4751 XB","Oud Gastel"]
[143,"Dhr.R.Derksen",null,"5625 WV","Eindhoven"]
[142,"Dhr. J.Leenders",null,"5658 LJ","Eindhoven"]
[141,"Dhr./Mevr. Th.Bosma",null,"6019 CN","Wessem"]
[140,"Dhr./Mvr. Steenkamp",null,"5463 HK","Veghel"]
[139,"Bram en Cindy Barkhuysen",null,"6026 ET","Maarheeze"]
[138,"P.Kroese",null,"5622 JR","Eindhoven","040-2435692"]
[137,"de Kruijf",null,"5642 HC","Eindhoven"]
[136,"Kristi Maynard",null,"5611 XG","Eindhoven"]
[135,"Audio TV Centrum","Roel van Nunspeet","5611 SE","Eindhoven"]
[134,"Mevr. A. Krijger",null,"5672 PA","Nuenen"]
[133,"Mevr. D.Staaijen",null,"5628 GC","Eindhoven"]
[132,"Mevr. M. Apeldoorn",null,"5663 RA","Geldrop"]
[131,"Dhr. A. Joosen",null,"4921 HW","Made"]
[130,"BBcon Europe BV","Frans Bax","5554 ND","Valkenswaard"]
[129,"Beenders",null,"6099 AM","Beegden"]
[128,"P.Rovers",null,"5463 CM","Veghel"]
[127,"GP Decor","","5145PE","Waalwijk","","",""]
[126,"R.C.M. vof","R.C. Manuhutu","5663 RA","Geldrop"]
[125,"Dhr./Mevr. Vlassak",null,"1211.04","Budel"]
[124,"Mevr. van Dooremaal",null,"5037 SM","Tilburg"]
[123,"Moonen",null,"6035 PE","Ospel"]
[122,"Heesterbeek",null,"6026 RX","Maarheeze"]
[121,"Mevr. K.Guns",null,"6026 CN","Maarheeze"]
[120,"Fantasia shop","P.Dierckx","3910","Neerpelt"]
[119,"Looijmans",null,"6021 NB","Budel"]
[118,"H.Willemssen",null,"5811 AM","Castenray"]
[117,"Van Kasteren",null,"5616 CJ","Eindhoven"]
[116,"Dhr./Mevr. Cox",null,"6027 SB","Soerendonk"]
[115,"Mevr. H.de Groen",null,"5215 EE","'s Hertogenbosch"]
[114,"Dhr./Mevr.Deeben",null,"5662 JK","Geldrop"]
[113,"R.Janssen",null,"5595 EG","Leende"]
[112,"Dhr. J.Willemssen en Mevr. L.Kateman",null,"5811 AN","Castenray"]
[111,"Willemssen varkenshouderij",null,"5811 AN","Castenray"]
[110,"Lieffering",null,"5702 AZ","Helmond"]
[109,"Turner",null,"6603 JW","Wijchen"]
[108,"Strijbos",null,"5671 VJ","Nuenen"]
[107,"Conbit Engineering","I.Kemps","5683 CZ","Best"]
[106,"M.G.M. de Vries",null,"6023 AN","Budelschoot"]
[105,"Korver",null,"6603 JW","Wijchen"]
[104,"Doomen",null,"6026 DR","Maarheeze"]
[103,"Dhr./Mevr. van Dijk",null,"5595 GP","Leenderstrijp"]
[102,"Koninklijke Peijnenburg","mevr. W. Castelijns","5664 HB","Geldrop"]
[101,"Mevr. P.Colen","Ruusbroeclaan 96","5702 AZ","Helmond"]
[100,"Eckart Benelux BV","Ger Reehuis","5400 AE","Uden"]
[99,"VTS Constructions","Hein Stark","6026 RB","Maarheeze"]
[98,"DFA services","(eigen kosten zorgverzekeraar VGZ)","8025 AV","Zwolle"]
[97,"van Meijl Stoffering",null,"6028 RK","Gastel"]
[96,"Bateu BV","Dhr. B.van der Sluijs","5683 ED ","Best"]
[95,"Ambiance Badkamers","Barry Wijnen","5664 EN","Geldrop"]
[94,"A. Hogers",null,"B3920","Lommel"]
[93,"P. Reuvers en M.Simons",null,"5615 CP","Eindhoven"]
[92,"Yig Enginering","Paul Reuvers","5616 CP","Eindhoven"]
[91,"Wildenberg Mode","Niels Wildenberg","5611 JT","Eindhoven"]
[90,"S.Smits",null,"5944EH ","Arcen"]
[89,"Janssen",null,"5667 AB","Geldrop"]
[88,"Martens",null,"6021 EH","Budel"]
[87,"Mills",null,"5583 CB","Waalre"]
[86,"Winters Groothandel-Drankenspeciaalzaak BV","Everard Winters","6026 EB","Maarheeze"]
[85,"Slegers",null,"6026 DG","Maarheeze"]
[84,"E M R I Lighting v.o.f.","E. van Kampen","5674 TL","Nuenen"]
[83,"E. van Kampen",null,"5674 NT","Nederwetten (Nuenen)"]
[82,"H.Decker",null,"5666 KA","Geldrop"]
[81,"P.van den Borne ",null,"5531 DE","Bladel"]
[80,"Boonen Industries & Service NV","Johan Boonen","B3920","Lommel","0032-11640439","0032475260755","bisnv@skynet.be"]
[79,"Seasun interiors","Hans Gudden","5708 TK","Helmond"]
[78,"Instituut Broers","Corne Broers","5022 DV","Tilburg"]
[77,"P. Rozenveld",null,"6026 DK","Maarheeze"]
[76,"Mike Pietersen",null,"6023 EC","Budel-Schoot"]
[75,"van Duuren",null,"1391 SZ","Abcoude"]
[74,"Hanenberg",null,"5673 KB","Nuenen"]
[73,"Balance","Johan Mansvelders","5503 CH","Veldhoven"]
[72,"de Bije",null,"5694 VE","Son en Breugel"]
[71,"Cees Castelijns Bouwadvies","Cees Castelijns","5667 JG","Geldrop"]
[70,"Vosco Jachtinterieur BV","Aran en Michael Vos","5256 PN","Heusden"]
[69,"van Kampen- Wijnen","Wendy Wijnen","5663 SE","Geldrop","040-7074840"]
[68,"Ben de Graaff Project BV","","5145PE","Waalwijk","0416-286345","",""]
[67,"Open Communicatie Creatie","Mikki Pepels","5616 LW","Eindhoven"]
[66,"Key On Planning bv","Martin Daudey","5735 PC","Aarle Rixtel"]
[65,"Jeroen Sol Witgoed VOF","","6028 RJ","Gastel"]
[64,"Apotheek Maarheeze","Yv Visscher","6026 ER","Maarheeze"]
[63,"Café Bar 't Huukske","Wil Bazelmans","6026 CV","Maarheeze"]
[62,"Hompes",null,"6021 LV","Budel"]
[61,"Mulders",null,"5644 DR","Eindhoven"]
[60,"Princess Yachts Benelux bv","H. Schalkwijk","5266 PL ","Heusden"]
[59,"Staals",null,"6026 CC ","Maarheeze"]
[58,"Schooneman",null,"5702 AZ","Helmond"]
[57,"TMV woning & projekt stoffering",null,"5625 GT","Eindhoven"]
[56,"Molenbroek",null,"5628 ZH","Eindhoven"]
[55,"van Wageningen",null,"1074 CE","Amsterdam"]
[54,"van Wageningen",null,"5611 BG ","Eindhoven"]
[53,"Verberne",null,"5712 VJ","Someren-Heide"]
[52,"Lammers- Vlassak",null,"6021 MK","Budel"]
[51,"Weerdenburg",null,"5667 JE","Geldrop"]
[50,"Pieterse","Raymond Pieterse","5644 DT","Eindhoven","06-50632951"]
[49,"F. Brugts",null,"3072 WJ ","Rotterdam"]
[48,"Wijnen",null,"5591 LJ","Heeze"]
[47,"Willemse",null,"5666 RM","Geldrop"]
[46,"Van Doren",null,"5643 EB","Eindhoven"]
[45,"Neijssen",null,"6021 JV","Budel"]
[44,"Stuiten","","5712 BG","Someren"]
[43,"Dhr./Mevr. Kwakernaak",null,"5583 AD","Aalst-Waalre"]
[42,"Mevr.M. Barts",null,"5643 RC","Eindhoven","040-2118977",null,"m.barts@planet.nl"]
[41,"Kant","Patrick Kant","3900","Overpelt","06-53685925"]
[40,"Mac Donald",null,"5646 HX","Eindhoven","040-2127943","06-28074405"]
[39,"de Vries",null,"5642 CS","Eindhoven"]
[38,"Staaijen","Johan Staaijen","3111 BJ","Schiedam"]
[37,"M. van Rijsingen",null,"5627 KD","Eindhoven"]
[36,"C. Schellekens",null,"3920","Lommel"]
[35,"Dhr./Mevr.Goossens",null,"5626 BX","Eindhoven"]
[34,"J. de Visser",null,"2811 LH ","Reeuwijk"]
[33,"R. Hommerson",null,"2811 LH","Reeuwijk"]
[32,"Firma Permea","Hans Spee en Henk de Vries","5612 LX","Eindhoven"]
[31,"Manuhuttu",null,"5663 RA","Geldrop"]
[30,"Houbolt","Dhr. C.J. Houbolt","5655 HR","Eindhoven"]
[29,"Stollman",null,"6021 VW","Budel"]
[28,"Klussenbedrijf de man","Jan de man","5642 HE ","Eindhoven"]
[27,"De Kruijf",null,"3404 CC","IJselstein"]
[26,"Frie en Heidi van Herk/Schoofs",null,"3920","Lommel"]
[25,"Bakker",null,"8077 RP","Hulshorst","0341-267992","06-51816953"]
[24,"Slenders Reclameprodukties","P. Slenders","6023 AJ","Budel-Schoot"]
[23,"Claessens",null,"5712 ES ","Someren","0493-496256"]
[22,"van Deursen Administratie","A. van Deursen","5503 GE","Veldhoven"]
[21,"Becker Projectinrichting","Ab Becker","5644 JD","Eindhoven","040-2615233","06-51422471"]
[20,"J.Hendriks / Schooneman",null,"5692 VD","Son en Breugel","0492-476068"]
[19,"Mevr. v/d Hueij",null,"5643 HN","Best"]
[18,"Mevr Anne Henry",null,"5582 GJ","Waalre"]
[17,"Verspaandonk herenmode","Edwin van Gaal","6021 CD","Budel","0495-497632","06-52014717"]
[16,"M.Smit",null,"6026 VD","Maarheeze","0495-594082","06-83037787"]
[15,"K.Nelissen",null,"5122 KB","Rijen","0161-227133","06-51074295","k.nelissen@kpnplanet.nl"]
[14,"Kip",null,"5508 HD","Veldhoven","040-2544278","0651111898"]
[13,"Verbeek / Bakker",null,"3920","Lommel",null,"06-52461279"]
[12,"P.Raes en M van Sambeek",null,"5651 CS","Eindhoven","06-21413341"]
[11,"Chinees Restaurant Dragon City","Xiao Wei","5642 NA","Eindhoven","040-2815001","06-46243199"]
[10,"Circle of Rotations","Mike Pietersen","6023 EC","Budel-Schoot"]
[9,"J.van Lieshout",null,"5672 VR","Nuenen","040-2835613"]
[8,"Cafetaria d\"n Doel","Geert Sanders","5541 EZ","Reusel"]
[7,"TU/e Innovation","Mevr. M.v Renswouw","5612 AX","Eindhoven"]
[6,"Q-Blinds","Joost de Beijer","6026 ZH","Maarheeze","0495-599326","06-53435711","joost@qblinds.nl"]
[5,"Heart Medical Europe","Gerrit van Wageningen","5683 CT","Best","0499-377388","06-53327468","info@heartmedical.nl"]
[4,"A. van der Kruijs",null,"5631 HD","Eindhoven"]
[3,"N. Wildenberg",null,"5611 LP","Eindhoven"]
[2,"TU/e Connector","M.van Renswouw","5612 AS ","Eindhoven"]
[1,"M for Curtains","René Molenbroek","5652 AK","Eindhoven","0641472026","06-41472026","info@mforcurtains.com"]
[-2,"Klant onbekend"]

{"sheet":"Leveranciersdata","index":16,"n_rows":12,"n_cols":7,"rows_kept":12,"cut":false,"hidden":true,"merged":[]}
[]
[null,"Plaats de cursor op de juiste cel in kolom A, maar nooit op of verder dan de cel met de waarde 5einde lijst. Klik daarna op de knop \"Waarde toevoegen\"."]
[null,"Plaats de nieuwe waarden in de lege rij die boven de eerder gekozen cel verschijnt."]
["Merknaam","Te bestellen bij","Contactpersoon","Adres","Postcode","Woonplaats","Mailadres"]
[]
["De Ploeg","Harotex Gordijnenatelier BV","Gerard Gordijn","Vlamovenweg 8","5709 JV","Helmond","gerard@harotex.nl"]
["Goelst","Goelst Curtain Rail Systems BV","Simon Schroefje","Lorentzstraat 11","6716 AD","Ede","simon@goelst.nl"]
["Interstil","Insterstil Benelux","Henk Haakje","Kuiper 16","5253 RJ","Nieuwkuijk","henk@interstil.nl"]
["XYZ"]
["Kobe","Harotex Gordijnenatelier BV","Pieter Puk","Vlamovenweg 8","5708 JV","Helmond","pieter@harotex.nl"]
[]
[" 5einde lijst"]