{"text_format":"1","workbook":"xlsx","n_sheets":17,"sheets":["Inmeetaanvraag","Toelichting","Inmeetformulier","Tijd","Offerte goederen","Offerte montage","Vertrekaanduidingen","Prijslijst","Offerte totaal","Bestelformulier","Factuurregels","Factuurspec. aanbet.","Factuurspec. deel- of restbet.","Dossier","Formulierdata","Klantdata","Leveranciersdata"],"not_rendered":{"charts":0,"images":11,"macros":1,"external_links":0,"defined_names":23,"comments":6,"pivot_tables":0},"unopened":[],"bounds":{"document_bytes":16777216,"sheet_cells":100000,"rows_first":2000,"rows_last":500,"rows_between":2000,"halvings":0,"cell_chars":16384,"cell_head_chars":4096},"cells_cut":0,"cells_raw":0,"read":"whole","date_system":"1900"}

{"sheet":"Inmeetaanvraag","index":0,"n_rows":18,"n_cols":11,"rows_kept":18,"cut":false,"hidden":false,"merged":[[9,2,9,6],[4,4,4,6],[5,2,5,6],[6,2,6,6],[7,3,7,6],[8,2,8,6],[16,2,16,6],[11,3,11,6],[12,3,12,6],[14,2,14,6],[14,7,15,9],[15,2,15,6]]}
[]
[null,null,"Verzoek om inmeting"]
[null,null,null,null,null,null,null,null,null,null,true]
[null,true,"Aanhef","Voorl.","Achternaam"]
[null,"Naam klant/contactpers.:"]
[null,"Organisatie:"]
[null,"Montage-adres:"]
[null,"Postcode/Wplts.:"]
{"$rows_left_out":11}
{"sheet":"Toelichting","index":1,"n_rows":97,"n_cols":5,"rows_kept":97,"cut":false,"hidden":false,"merged":[]}
[]
[null,"Plooien",null,"Terug"]
[]
[null,null,null,null,"Enkel"]
[]
[]
[]
[]
{"$rows_left_out":90}
{"sheet":"Inmeetformulier","index":2,"n_rows":125,"n_cols":19,"rows_kept":125,"cut":false,"hidden":true,"merged":[[21,1,21,2],[14,2,14,3],[15,2,15,3],[21,6,21,7],[11,3,11,4],[12,3,12,4]]}
[]
[null,null,"Inmeetformulier"]
[]
[null,null,"Aanhef","Voorl.","Achternaam"]
[null,"Naam klant/contactpers.:",{"$f":"Inmeetaanvraag!C5","v":0},{"$f":"Inmeetaanvraag!D5","v":0},{"$f":"Inmeetaanvraag!E5","v":0}]
[null,"Organisatie:",{"$f":"Inmeetaanvraag!C6","v":0}]
[null,"Montage-adres:",{"$f":"Inmeetaanvraag!C7","v":0}]
[null,"Postcode/Wplts.:",{"$f":"Inmeetaanvraag!C8","v":0},{"$f":"Inmeetaanvraag!D8","v":0}]
{"$rows_left_out":118}
{"sheet":"Tijd","index":3,"n_rows":96,"n_cols":1,"rows_kept":96,"cut":false,"hidden":true,"merged":[]}
["00:00:00"]
["00:15:00"]
["00:30:00"]
["00:45:00"]
["01:00:00"]
["01:15:00"]
["01:30:00"]
["01:45:00"]
{"$rows_left_out":89}
{"sheet":"Offerte goederen","index":4,"n_rows":125,"n_cols":25,"rows_kept":125,"cut":false,"hidden":true,"merged":[[21,1,21,2],[21,5,21,7],[9,2,9,7],[11,3,11,7],[12,3,12,7],[14,2,14,3],[15,2,15,3],[17,2,17,7],[17,15,17,18],[18,15,18,18],[19,15,19,18],[19,20,19,22],[8,2,8,7],[17,20,17,22],[18,20,18,22],[14,6,14,7],[15,6,15,7],[18,2,18,7],[19,2,19,7],[2,4,2,5],[4,4,4,7],[5,2,5,7],[6,2,6,7],[7,3,7,7]]}
[]
[null,null,"Offerte / Goederen"]
[]
[null,null,"Aanhef","Voorl.","Achternaam"]
[null,"Naam klant/contactpers.:",{"$f":"Inmeetformulier!C5","v":0},{"$f":"Inmeetformulier!D5","v":0},{"$f":"Inmeetformulier!E5","v":0}]
[null,"Organisatie:",{"$f":"Inmeetformulier!C6","v":0}]
[null,"Montage-adres:",{"$f":"Inmeetformulier!C7","v":0}]
[null,"Postcode/Wplts.:",{"$f":"Inmeetformulier!C8","v":0},{"$f":"Inmeetformulier!D8","v":0}]
{"$rows_left_out":118}
{"sheet":"Offerte montage","index":5,"n_rows":125,"n_cols":19,"rows_kept":125,"cut":false,"hidden":true,"merged":[[124,2,124,7],[23,2,23,7],[118,2,118,7],[119,2,119,7],[120,2,120,7],[121,2,121,7],[122,2,122,7],[123,2,123,7],[112,2,112,7],[113,2,113,7],[114,2,114,7],[115,2,115,7],[116,2,116,7],[117,2,117,7],[106,2,106,7],[107,2,107,7],[108,2,108,7],[109,2,109,7],[110,2,110,7],[111,2,111,7],[100,2,100,7],[101,2,101,7],[102,2,102,7],[103,2,103,7],[104,2,104,7],[105,2,105,7],[94,2,94,7],[95,2,95,7],[96,2,96,7],[97,2,97,7],[98,2,98,7],[99,2,99,7],[88,2,88,7],[89,2,89,7],[90,2,90,7],[91,2,91,7],[92,2,92,7],[93,2,93,7],[82,2,82,7],[83,2,83,7],[84,2,84,7],[85,2,85,7],[86,2,86,7],[87,2,87,7],[76,2,76,7],[77,2,77,7],[78,2,78,7],[79,2,79,7],[80,2,80,7],[81,2,81,7],[70,2,70,7],[71,2,71,7],[72,2,72,7],[73,2,73,7],[74,2,74,7],[75,2,75,7],[64,2,64,7],[65,2,65,7],[66,2,66,7],[67,2,67,7],[68,2,68,7],[69,2,69,7],[58,2,58,7],[59,2,59,7],[60,2,60,7],[61,2,61,7],[62,2,62,7],[63,2,63,7],[52,2,52,7],[53,2,53,7],[54,2,54,7],[55,2,55,7],[56,2,56,7],[57,2,57,7],[46,2,46,7],[47,2,47,7],[48,2,48,7],[49,2,49,7],[50,2,50,7],[51,2,51,7],[40,2,40,7],[41,2,41,7],[42,2,42,7],[43,2,43,7],[44,2,44,7],[45,2,45,7],[34,2,34,7],[35,2,35,7],[36,2,36,7],[37,2,37,7],[38,2,38,7],[39,2,39,7],[28,2,28,7],[29,2,29,7],[30,2,30,7],[31,2,31,7],[32,2,32,7],[33,2,33,7],[24,2,24,7],[25,2,25,7],[26,2,26,7],[27,2,27,7],[17,2,17,7],[18,2,18,7],[18,14,18,16],[19,2,19,7],[19,14,19,16],[18,9,18,12],[17,14,17,16],[17,9,17,12],[2,4,2,5],[4,4,4,7],[5,2,5,7],[6,2,6,7],[7,3,7,7],[8,2,8,7],[14,4,14,5],[15,4,15,5],[21,1,21,2],[21,5,21,7],[9,2,9,7],[11,3,11,7],[12,3,12,7],[14,2,14,3],[14,6,14,7],[15,2,15,3],[15,6,15,7]]}
[]
[null,null,"Offerte / Montage- en overige kosten"]
[]
[null,null,"Aanhef","Voorl.","Achternaam"]
[null,"Naam klant/contactpers.:",{"$f":"'Offerte goederen'!C5","v":0},{"$f":"'Offerte goederen'!D5","v":0},{"$f":"'Offerte goederen'!E5","v":0}]
[null,"Organisatie:",{"$f":"'Offerte goederen'!C6","v":0}]
[null,"Montage-adres:",{"$f":"'Offerte goederen'!C7","v":0}]
[null,"Postcode/Wplts.:",{"$f":"'Offerte goederen'!C8","v":0},{"$f":"'Offerte goederen'!D8","v":0}]
{"$rows_left_out":118}
{"sheet":"Vertrekaanduidingen","index":6,"n_rows":102,"n_cols":2,"rows_kept":102,"cut":false,"hidden":true,"merged":[]}
["Vertrekaanduiding (1)","*"]
[{"$f":"IF(Inmeetformulier!B25=\"\",\"\",Inmeetformulier!B25)","v":""},""]
[{"$f":"IF(Inmeetformulier!B26=\"\",\"\",Inmeetformulier!B26)","v":""}]
[{"$f":"IF(Inmeetformulier!B27=\"\",\"\",Inmeetformulier!B27)","v":""}]
[{"$f":"IF(Inmeetformulier!B28=\"\",\"\",Inmeetformulier!B28)","v":""}]
[{"$f":"IF(Inmeetformulier!B29=\"\",\"\",Inmeetformulier!B29)","v":""}]
[{"$f":"IF(Inmeetformulier!B30=\"\",\"\",Inmeetformulier!B30)","v":""}]
[{"$f":"IF(Inmeetformulier!B31=\"\",\"\",Inmeetformulier!B31)","v":""}]
{"$rows_left_out":95}
{"sheet":"Prijslijst","index":7,"n_rows":101,"n_cols":5,"rows_kept":101,"cut":false,"hidden":true,"merged":[]}
["Item","Omschrijving","Prijs per eenh.\n(excl. BTW)","Eenheid","Prijs per eenh.\n(incl. BTW)"]
[1,"KS-Rail compleet incl. runners en plafondsteunen (zwart of wit)",9.5,"/m",{"$f":"IF(C2=\"\",\"\",C2*(1+Formulierdata!$A$29))","v":11.494999999999999}]
[2,"DS-Rail compleet incl. runners en plafondsteunen (zwart of wit)",10.75,"/m",{"$f":"IF(C3=\"\",\"\",C3*(1+Formulierdata!$A$29))","v":13.0075}]
[3,"Meerprijs bij KS/DS voor wandsteunen 35 mm",2.75,"/m",{"$f":"IF(C4=\"\",\"\",C4*(1+Formulierdata!$A$29))","v":3.3274999999999997}]
[4,"Meerprijs bij KS/DS voor wandsteunen 75 mm",4.5,"/m",{"$f":"IF(C5=\"\",\"\",C5*(1+Formulierdata!$A$29))","v":5.4450000000000003}]
[5,"G-rail 2100 compleet incl. runners en plafondsteunen",10,"/m",{"$f":"IF(C6=\"\",\"\",C6*(1+Formulierdata!$A$29))","v":12.1}]
[6,"Buigen KS- en G-rail per bocht",7.5,"/st",{"$f":"IF(C7=\"\",\"\",C7*(1+Formulierdata!$A$29))","v":9.0749999999999993}]
[7,"Buigen DS-rail per bocht",12.5,"/st",{"$f":"IF(C8=\"\",\"\",C8*(1+Formulierdata!$A$29))","v":15.125}]
{"$rows_left_out":94}
{"sheet":"Offerte totaal","index":8,"n_rows":24,"n_cols":14,"rows_kept":24,"cut":false,"hidden":true,"merged":[[21,1,21,2],[21,9,21,11],[12,9,12,11],[15,4,15,7],[15,9,15,11],[16,4,16,7],[16,9,16,11],[17,4,17,7],[17,9,17,11],[18,4,18,7],[18,9,18,11],[19,9,19,11],[20,9,20,11],[19,4,19,7],[10,9,10,11],[4,9,4,11],[5,9,5,11],[6,9,6,11],[8,9,8,11],[9,9,9,11]]}
[]
[null,null,{"$f":"IF(Dossier!C21=\"\",\"Klantofferte\",\"Klantofferte (bevestigd)\")","v":"Klantofferte"}]
[null,null,null,null,null,null,null,null,4]
[]
[null,"Naam klant/contactpers.:",{"$f":"CONCATENATE(IF('Offerte goederen'!C5=0,\"\",'Offerte goederen'!C5),\" \",IF('Offerte goederen'!D5=0,\"\",'Offerte goederen'!D5),\" \",IF('Offerte goederen'!E5=0,\"\",'Offerte goederen'!E5))","v":"  "}]
[null,"Organisatie:",{"$f":"'Offerte goederen'!C6","v":0}]
[null,"Montage-adres:",{"$f":"'Offerte goederen'!C7","v":0}]
[null,"Postcode/Wplts.:",{"$f":"CONCATENATE(IF('Offerte goederen'!C8=0,\"\",'Offerte goederen'!C8),\" \",IF('Offerte goederen'!D8=0,\"\",'Offerte goederen'!D8))","v":" "}]
{"$rows_left_out":17}
{"sheet":"Bestelformulier","index":9,"n_rows":123,"n_cols":17,"rows_kept":123,"cut":false,"hidden":true,"merged":[[18,11,18,13],[18,2,18,7],[19,2,19,7],[17,2,17,7],[12,2,12,7],[13,2,13,7],[14,3,14,7],[15,2,15,7],[17,9,17,10],[17,11,17,13],[4,2,4,7],[6,2,6,7],[7,2,7,7],[8,3,8,7],[10,2,10,7],[5,2,5,7]]}
[]
[null,null,"Bestelformulier"]
[]
[]
[null,"Merk"]
[null,"Leverancier",{"$f":"IF(ISERROR(VLOOKUP($C$5,Leveranciersdata!$A:$G,2,FALSE)),\"\",VLOOKUP($C$5,Leveranciersdata!$A:$G,2,FALSE))","v":""}]
[null,"T.a.v. ",{"$f":"IF(ISERROR(VLOOKUP($C$5,Leveranciersdata!$A:$G,3,FALSE)),\"\",VLOOKUP($C$5,Leveranciersdata!$A:$G,3,FALSE))","v":""}]
[null,"Adres",{"$f":"IF(ISERROR(VLOOKUP($C$5,Leveranciersdata!$A:$G,4,FALSE)),\"\",VLOOKUP($C$5,Leveranciersdata!$A:$G,4,FALSE))","v":""}]
{"$rows_left_out":116}
{"sheet":"Factuurregels","index":10,"n_rows":204,"n_cols":13,"rows_kept":204,"cut":false,"hidden":true,"merged":[]}
["Vertrek","Omschrijving",null,"Toelichting (evt.)",null,{"$f":"'Offerte goederen'!R24","v":"Prijs       (excl. BTW)"},"per",null,"Aantal\neenh.",null,"Bedrag\n(excl. BTW)",null,"Bedrag\n(incl. BTW)"]
[{"$f":"'Offerte goederen'!B25","v":0},{"$f":"CONCATENATE(IF('Offerte goederen'!C25=0,\"\",CONCATENATE('Offerte goederen'!C25,\", \")),IF('Offerte goederen'!O25=0,\"\",CONCATENATE(\"merk: \",'Offerte goederen'!O25)),IF('Offerte goederen'!N25=0,\"\",CONCATENATE(\", omschrijving: \",'Offerte goederen'!N25)),IF('Offerte goederen'!H25=0,\"\",CONCATENATE(\", plooi: \",'Offerte goederen'!H25)),IF('Offerte goederen'!J25=0,\"\",CONCATENATE(\", railtype: \",'Offerte goederen'!J25)),IF('Offerte goederen'!K25=0,\"\",CONCATENATE(\", railkleur: \",'Offerte goederen'!K25)))","v":""},"G",{"$f":"'Offerte goederen'!P25","v":0},null,{"$f":"IF(C2=\"G\",'Offerte goederen'!R25,IF(C2=\"M\",'Offerte montage'!L25,\"\"))","v":0},{"$f":"IF(C2=\"G\",'Offerte goederen'!S25,IF(C2=\"M\",'Offerte montage'!M25,\"\"))","v":0},null,{"$f":"IF(C2=\"G\",'Offerte goederen'!U25,IF(C2=\"M\",'Offerte montage'!O25,\"\"))","v":0},null,{"$f":"IF(C2=\"G\",'Offerte goederen'!W25,IF(C2=\"M\",'Offerte montage'!Q25,\"\"))","v":""},null,{"$f":"IF(C2=\"G\",'Offerte goederen'!Y25,IF(C2=\"M\",'Offerte montage'!S25,\"\"))","v":""}]
[{"$f":"'Offerte goederen'!B26","v":0},{"$f":"CONCATENATE(IF('Offerte goederen'!C26=0,\"\",CONCATENATE('Offerte goederen'!C26,\", \")),IF('Offerte goederen'!O26=0,\"\",CONCATENATE(\"merk: \",'Offerte goederen'!O26)),IF('Offerte goederen'!N26=0,\"\",CONCATENATE(\", omschrijving: \",'Offerte goederen'!N26)),IF('Offerte goederen'!H26=0,\"\",CONCATENATE(\", plooi: \",'Offerte goederen'!H26)),IF('Offerte goederen'!J26=0,\"\",CONCATENATE(\", railtype: \",'Offerte goederen'!J26)),IF('Offerte goederen'!K26=0,\"\",CONCATENATE(\", railkleur: \",'Offerte goederen'!K26)))","v":""},"G",{"$f":"'Offerte goederen'!P26","v":0},null,{"$f":"IF(C3=\"G\",'Offerte goederen'!R26,IF(C3=\"M\",'Offerte montage'!L26,\"\"))","v":0},{"$f":"IF(C3=\"G\",'Offerte goederen'!S26,IF(C3=\"M\",'Offerte montage'!M26,\"\"))","v":0},null,{"$f":"IF(C3=\"G\",'Offerte goederen'!U26,IF(C3=\"M\",'Offerte montage'!O26,\"\"))","v":0},null,{"$f":"IF(C3=\"G\",'Offerte goederen'!W26,IF(C3=\"M\",'Offerte montage'!Q26,\"\"))","v":""},null,{"$f":"IF(C3=\"G\",'Offerte goederen'!Y26,IF(C3=\"M\",'Offerte montage'!S26,\"\"))","v":""}]
[{"$f":"'Offerte goederen'!B27","v":0},{"$f":"CONCATENATE(IF('Offerte goederen'!C27=0,\"\",CONCATENATE('Offerte goederen'!C27,\", \")),IF('Offerte goederen'!O27=0,\"\",CONCATENATE(\"merk: \",'Offerte goederen'!O27)),IF('Offerte goederen'!N27=0,\"\",CONCATENATE(\", omschrijving: \",'Offerte goederen'!N27)),IF('Offerte goederen'!H27=0,\"\",CONCATENATE(\", plooi: \",'Offerte goederen'!H27)),IF('Offerte goederen'!J27=0,\"\",CONCATENATE(\", railtype: \",'Offerte goederen'!J27)),IF('Offerte goederen'!K27=0,\"\",CONCATENATE(\", railkleur: \",'Offerte goederen'!K27)))","v":""},"G",{"$f":"'Offerte goederen'!P27","v":0},null,{"$f":"IF(C4=\"G\",'Offerte goederen'!R27,IF(C4=\"M\",'Offerte montage'!L27,\"\"))","v":0},{"$f":"IF(C4=\"G\",'Offerte goederen'!S27,IF(C4=\"M\",'Offerte montage'!M27,\"\"))","v":0},null,{"$f":"IF(C4=\"G\",'Offerte goederen'!U27,IF(C4=\"M\",'Offerte montage'!O27,\"\"))","v":0},null,{"$f":"IF(C4=\"G\",'Offerte goederen'!W27,IF(C4=\"M\",'Offerte montage'!Q27,\"\"))","v":""},null,{"$f":"IF(C4=\"G\",'Offerte goederen'!Y27,IF(C4=\"M\",'Offerte montage'!S27,\"\"))","v":""}]
[{"$f":"'Offerte goederen'!B28","v":0},{"$f":"CONCATENATE(IF('Offerte goederen'!C28=0,\"\",CONCATENATE('Offerte goederen'!C28,\", \")),IF('Offerte goederen'!O28=0,\"\",CONCATENATE(\"merk: \",'Offerte goederen'!O28)),IF('Offerte goederen'!N28=0,\"\",CONCATENATE(\", omschrijving: \",'Offerte goederen'!N28)),IF('Offerte goederen'!H28=0,\"\",CONCATENATE(\", plooi: \",'Offerte goederen'!H28)),IF('Offerte goederen'!J28=0,\"\",CONCATENATE(\", railtype: \",'Offerte goederen'!J28)),IF('Offerte goederen'!K28=0,\"\",CONCATENATE(\", railkleur: \",'Offerte goederen'!K28)))","v":""},"G",{"$f":"'Offerte goederen'!P28","v":0},null,{"$f":"IF(C5=\"G\",'Offerte goederen'!R28,IF(C5=\"M\",'Offerte montage'!L28,\"\"))","v":0},{"$f":"IF(C5=\"G\",'Offerte goederen'!S28,IF(C5=\"M\",'Offerte montage'!M28,\"\"))","v":0},null,{"$f":"IF(C5=\"G\",'Offerte goederen'!U28,IF(C5=\"M\",'Offerte montage'!O28,\"\"))","v":0},null,{"$f":"IF(C5=\"G\",'Offerte goederen'!W28,IF(C5=\"M\",'Offerte montage'!Q28,\"\"))","v":""},null,{"$f":"IF(C5=\"G\",'Offerte goederen'!Y28,IF(C5=\"M\",'Offerte montage'!S28,\"\"))","v":""}]
[{"$f":"'Offerte goederen'!B29","v":0},{"$f":"CONCATENATE(IF('Offerte goederen'!C29=0,\"\",CONCATENATE('Offerte goederen'!C29,\", \")),IF('Offerte goederen'!O29=0,\"\",CONCATENATE(\"merk: \",'Offerte goederen'!O29)),IF('Offerte goederen'!N29=0,\"\",CONCATENATE(\", omschrijving: \",'Offerte goederen'!N29)),IF('Offerte goederen'!H29=0,\"\",CONCATENATE(\", plooi: \",'Offerte goederen'!H29)),IF('Offerte goederen'!J29=0,\"\",CONCATENATE(\", railtype: \",'Offerte goederen'!J29)),IF('Offerte goederen'!K29=0,\"\",CONCATENATE(\", railkleur: \",'Offerte goederen'!K29)))","v":""},"G",{"$f":"'Offerte goederen'!P29","v":0},null,{"$f":"IF(C6=\"G\",'Offerte goederen'!R29,IF(C6=\"M\",'Offerte montage'!L29,\"\"))","v":0},{"$f":"IF(C6=\"G\",'Offerte goederen'!S29,IF(C6=\"M\",'Offerte montage'!M29,\"\"))","v":0},null,{"$f":"IF(C6=\"G\",'Offerte goederen'!U29,IF(C6=\"M\",'Offerte montage'!O29,\"\"))","v":0},null,{"$f":"IF(C6=\"G\",'Offerte goederen'!W29,IF(C6=\"M\",'Offerte montage'!Q29,\"\"))","v":""},null,{"$f":"IF(C6=\"G\",'Offerte goederen'!Y29,IF(C6=\"M\",'Offerte montage'!S29,\"\"))","v":""}]
[{"$f":"'Offerte goederen'!B30","v":0},{"$f":"CONCATENATE(IF('Offerte goederen'!C30=0,\"\",CONCATENATE('Offerte goederen'!C30,\", \")),IF('Offerte goederen'!O30=0,\"\",CONCATENATE(\"merk: \",'Offerte goederen'!O30)),IF('Offerte goederen'!N30=0,\"\",CONCATENATE(\", omschrijving: \",'Offerte goederen'!N30)),IF('Offerte goederen'!H30=0,\"\",CONCATENATE(\", plooi: \",'Offerte goederen'!H30)),IF('Offerte goederen'!J30=0,\"\",CONCATENATE(\", railtype: \",'Offerte goederen'!J30)),IF('Offerte goederen'!K30=0,\"\",CONCATENATE(\", railkleur: \",'Offerte goederen'!K30)))","v":""},"G",{"$f":"'Offerte goederen'!P30","v":0},null,{"$f":"IF(C7=\"G\",'Offerte goederen'!R30,IF(C7=\"M\",'Offerte montage'!L30,\"\"))","v":0},{"$f":"IF(C7=\"G\",'Offerte goederen'!S30,IF(C7=\"M\",'Offerte montage'!M30,\"\"))","v":0},null,{"$f":"IF(C7=\"G\",'Offerte goederen'!U30,IF(C7=\"M\",'Offerte montage'!O30,\"\"))","v":0},null,{"$f":"IF(C7=\"G\",'Offerte goederen'!W30,IF(C7=\"M\",'Offerte montage'!Q30,\"\"))","v":""},null,{"$f":"IF(C7=\"G\",'Offerte goederen'!Y30,IF(C7=\"M\",'Offerte montage'!S30,\"\"))","v":""}]
[{"$f":"'Offerte goederen'!B31","v":0},{"$f":"CONCATENATE(IF('Offerte goederen'!C31=0,\"\",CONCATENATE('Offerte goederen'!C31,\", \")),IF('Offerte goederen'!O31=0,\"\",CONCATENATE(\"merk: \",'Offerte goederen'!O31)),IF('Offerte goederen'!N31=0,\"\",CONCATENATE(\", omschrijving: \",'Offerte goederen'!N31)),IF('Offerte goederen'!H31=0,\"\",CONCATENATE(\", plooi: \",'Offerte goederen'!H31)),IF('Offerte goederen'!J31=0,\"\",CONCATENATE(\", railtype: \",'Offerte goederen'!J31)),IF('Offerte goederen'!K31=0,\"\",CONCATENATE(\", railkleur: \",'Offerte goederen'!K31)))","v":""},"G",{"$f":"'Offerte goederen'!P31","v":0},null,{"$f":"IF(C8=\"G\",'Offerte goederen'!R31,IF(C8=\"M\",'Offerte montage'!L31,\"\"))","v":0},{"$f":"IF(C8=\"G\",'Offerte goederen'!S31,IF(C8=\"M\",'Offerte montage'!M31,\"\"))","v":0},null,{"$f":"IF(C8=\"G\",'Offerte goederen'!U31,IF(C8=\"M\",'Offerte montage'!O31,\"\"))","v":0},null,{"$f":"IF(C8=\"G\",'Offerte goederen'!W31,IF(C8=\"M\",'Offerte montage'!Q31,\"\"))","v":""},null,{"$f":"IF(C8=\"G\",'Offerte goederen'!Y31,IF(C8=\"M\",'Offerte montage'!S31,\"\"))","v":""}]
{"$rows_left_out":197}
{"sheet":"Factuurspec. aanbet.","index":11,"n_rows":24,"n_cols":14,"rows_kept":24,"cut":false,"hidden":true,"merged":[[10,9,10,11],[4,9,4,11],[5,9,5,11],[6,9,6,11],[8,9,8,11],[9,9,9,11],[21,1,21,2],[21,9,21,11],[12,9,12,11],[15,4,15,7],[15,9,15,11],[16,4,16,7],[16,9,16,11],[17,4,17,7],[17,9,17,11],[22,4,22,7],[22,9,22,11],[18,4,18,7],[18,9,18,11],[19,4,19,7],[19,9,19,11],[20,9,20,11]]}
[]
[null,null,"Factuurspecificatie (aanbetaling)"]
[null,null,null,null,null,null,null,null,4]
[]
[null,"Naam klant/contactpers.:",{"$f":"CONCATENATE(IF('Offerte goederen'!C5=0,\"\",'Offerte goederen'!C5),\" \",IF('Offerte goederen'!D5=0,\"\",'Offerte goederen'!D5),\" \",IF('Offerte goederen'!E5=0,\"\",'Offerte goederen'!E5))","v":"  "}]
[null,"Organisatie:",{"$f":"'Offerte goederen'!C6","v":0}]
[null,"Montage-adres:",{"$f":"'Offerte goederen'!C7","v":0}]
[null,"Postcode/Wplts.:",{"$f":"CONCATENATE(IF('Offerte goederen'!C8=0,\"\",'Offerte goederen'!C8),\" \",IF('Offerte goederen'!D8=0,\"\",'Offerte goederen'!D8))","v":" "}]
{"$rows_left_out":17}
{"sheet":"Factuurspec. deel- of restbet.","index":12,"n_rows":24,"n_cols":14,"rows_kept":24,"cut":false,"hidden":true,"merged":[[10,9,10,11],[4,4,4,7],[4,9,4,11],[5,9,5,11],[6,9,6,11],[8,9,8,11],[9,9,9,11],[21,1,21,2],[21,9,21,11],[12,9,12,11],[15,4,15,7],[15,9,15,11],[16,4,16,7],[16,9,16,11],[17,4,17,7],[17,9,17,11],[22,4,22,7],[22,9,22,11],[20,4,20,7],[18,4,18,7],[18,9,18,11],[19,4,19,7],[19,9,19,11],[20,9,20,11]]}
[]
[null,null,"Factuurspecificatie (restbetaling)"]
[null,null,null,null,null,null,null,null,4]
[]
[null,"Naam klant/contactpers.:",{"$f":"CONCATENATE(IF('Offerte goederen'!C5=0,\"\",'Offerte goederen'!C5),\" \",IF('Offerte goederen'!D5=0,\"\",'Offerte goederen'!D5),\" \",IF('Offerte goederen'!E5=0,\"\",'Offerte goederen'!E5))","v":"  "},null,{"$f":"IF(Dossier!H18>0,\"Nog te factureren restbedrag (incl./excl. BTW): \",\"\")","v":""},null,null,null,null,{"$f":"IF(Dossier!H18>0,Dossier!H18,\"Volledig gefactureerd\")","v":"Volledig gefactureerd"},null,null,null,{"$f":"IF(J5=\"Volledig gefactureerd\",\"\",(1/(1+Formulierdata!A29))*J5)","v":""}]
[null,"Organisatie:",{"$f":"'Offerte goederen'!C6","v":0}]
[null,"Montage-adres:",{"$f":"'Offerte goederen'!C7","v":0}]
[null,"Postcode/Wplts.:",{"$f":"CONCATENATE(IF('Offerte goederen'!C8=0,\"\",'Offerte goederen'!C8),\" \",IF('Offerte goederen'!D8=0,\"\",'Offerte goederen'!D8))","v":" "}]
{"$rows_left_out":17}
{"sheet":"Dossier","index":13,"n_rows":21,"n_cols":8,"rows_kept":21,"cut":false,"hidden":true,"merged":[]}
[]
[null,"Betalingsdossier"]
[]
[null,"Kortingsscenario (a t/m i):",{"$f":"'Offerte totaal'!M14","v":"a"},{"$f":"(CONCATENATE(\"= \",VLOOKUP(C4,D5:E14,2,FALSE)))","v":"= BTW berekenen, geen korting"}]
[null,null,null,"a","BTW berekenen, geen korting"]
[null,null,null,"b","BTW berekenen, korting in € vóór BTW"]
[null,null,null,"c","BTW berekenen, korting in € ná BTW"]
[null,null,null,"d","BTW berekenen, korting in % vóór BTW"]
{"$rows_left_out":14}
{"sheet":"Formulierdata","index":14,"n_rows":29,"n_cols":11,"rows_kept":29,"cut":false,"hidden":true,"merged":[[1,3,1,14]]}
[]
[null,null,null,"Plaats de cursor op de juiste cel in de rij naar keuze, maar nooit op of rechts van de cel met de waarde 3einde lijst. Klik daarna op de knop \"Waarde toevoegen\". Plaats de nieuwe waarde in de lege cel, die links van de gekozen cel verschijnt."]
[]
["Aanhef"]
["Dhr.","Mevr.","Dhr. en mevr.","Fam."," 3einde lijst"]
["Artikelomschrijving"]
["Gordijn","Vouwgordijn","Rolgordijn","Inbetween","Duette","Plissé","Jaloezie","Lamellen","Rail","Overig"," 3einde lijst"]
["Strak/Blijvend"]
{"$rows_left_out":22}
{"sheet":"Klantdata","index":15,"n_rows":545,"n_cols":8,"rows_kept":545,"cut":false,"hidden":true,"merged":[]}
["Klantcode","Naam","Contactpersoon","Postcode","Plaats","Telefoon","Mobiel","E-mail"]
[544,"EBN Certification BV","Cock van Zwienen","3316KG","Dordrecht","078-2003400","06-50655645","cvz@ebncertification.nl"]
[543,"Cheryll Verhoeven",null,"5617 AR","Eindhoven",null,null,"verhoeven.cs@gmail.com"]
[542,"Andre Rutjens",null,"6026CG","Maarheeze",null,null,""]
[541,"Keijsers Interiors","Hans Smetsers","5961PT","Horst","077-3974100","","facturen@keijsersinteriors.com"]
[540,"Infinity Print","Bas Stribos","56178AC","Eindhoven","","","bas@infinityprint.nl"]
[539,"Fam. van Kruijsdijk",null,"5623KW","Eindhoven",null,null,""]
[538,"Frank en Patricia Bornebroek",null,"5615JL","Eindhoven",null,null,""]
{"$rows_left_out":538}
{"sheet":"Leveranciersdata","index":16,"n_rows":12,"n_cols":7,"rows_kept":12,"cut":false,"hidden":true,"merged":[]}
[]
[null,"Plaats de cursor op de juiste cel in kolom A, maar nooit op of verder dan de cel met de waarde 5einde lijst. Klik daarna op de knop \"Waarde toevoegen\"."]
[null,"Plaats de nieuwe waarden in de lege rij die boven de eerder gekozen cel verschijnt."]
["Merknaam","Te bestellen bij","Contactpersoon","Adres","Postcode","Woonplaats","Mailadres"]
[]
["De Ploeg","Harotex Gordijnenatelier BV","Gerard Gordijn","Vlamovenweg 8","5709 JV","Helmond","gerard@harotex.nl"]
["Goelst","Goelst Curtain Rail Systems BV","Simon Schroefje","Lorentzstraat 11","6716 AD","Ede","simon@goelst.nl"]
["Interstil","Insterstil Benelux","Henk Haakje","Kuiper 16","5253 RJ","Nieuwkuijk","henk@interstil.nl"]
{"$rows_left_out":4}